{"text_format":"1","workbook":"xlsx","n_sheets":18,"sheets":["MATRICULA","APROV 1","R6","PARTICIPACIÓN 1","Gráfica APROV 1","Gráfica PART 1","APROV 2","R6 (2)","PARTICIPACIÓN 2","Gráfica APROV 2","Gráfica PART 2","APROV 3","R6 (3)","PARTICIPACIÓN 3","Gráfica APROV 3","Gráfica PART 3","Gráfica Promedios Finales","NORMALIDAD MÍNIMA"],"not_rendered":{"charts":7,"images":1,"macros":1,"external_links":1,"defined_names":3,"comments":0,"pivot_tables":0},"unopened":[],"bounds":{"document_bytes":16777216,"sheet_cells":100000,"rows_first":2000,"rows_last":500,"rows_between":2000,"halvings":0,"cell_chars":16384,"cell_head_chars":4096},"cells_cut":0,"cells_raw":0,"read":"whole","date_system":"1900"}

{"sheet":"MATRICULA","index":0,"n_rows":43,"n_cols":38,"rows_kept":43,"cut":false,"hidden":false,"merged":[[28,1,31,1],[28,2,28,25],[12,1,15,1],[12,2,12,25],[30,2,30,4],[30,5,30,7],[13,2,13,13],[13,14,13,25],[14,2,14,4],[14,5,14,7],[14,8,14,10],[14,11,14,13],[14,14,14,16],[30,35,30,37],[30,8,30,10],[30,11,30,13],[30,14,30,16],[30,17,30,19],[30,20,30,22],[30,23,30,25],[30,26,30,28],[30,29,30,31],[30,32,30,34],[28,26,29,37],[29,2,29,13],[29,14,29,25],[14,17,14,19],[14,20,14,22],[14,23,14,25],[2,2,2,30],[3,2,3,30],[4,2,4,30],[6,2,6,13],[6,14,6,26],[5,2,5,13],[5,14,5,26],[9,1,9,6],[9,8,9,26],[10,32,10,33],[10,27,10,31],[10,1,10,3],[10,8,10,26]]}
[]
[]
[null,null,"Secretaría de Educación Pública del Estado de Baja California Sur"]
[null,null,"Dirección de Educación Secundaria"]
[null,null,"MATRÍCULA"]
[null,null,"PERIODO DE EVALUACIÓN:",null,null,null,null,null,null,null,null,null,null,null,"CONCENTRADO FINAL"]
[null,null,"CICLO ESCOLAR :",null,null,null,null,null,null,null,null,null,null,null,"2021-2022"]
[]
[]
[null,"DIRECCIÓN: ",null,null,null,null,null,null,"EDUCACIÓN SECUNDARIA"]
[null,"DIRECTORA:",null,null,null,null,null,null,"MTRA. OFELIA ELIZABETH OCHOA ROMERO"]
[]
[null,"Modalidad","MATRÍCULA"]
[null,null,"INSCRIPCIÓN INICIAL ",null,null,null,null,null,null,null,null,null,null,null,"CAMBIOS DESDE OTRAS ESCUELAS (ALTAS)"]
[null,null,"PRIMERO",null,null,"SEGUNDO",null,null,"TERCERO",null,null,"TOTAL",null,null,"PRIMERO",null,null,"SEGUNDO",null,null,"TERCERO",null,null,"TOTAL"]
[null,null,"H","M","T","H","M","T","H","M","T","H","M","T","H","M","T","H","M","T","H","M","T","H","M","T"]
[null,"Generales Públicas",2819,2725,{"$f":"IF(SUM(C17,D17)=0,\"\",SUM(C17,D17))","v":5544},2826,2902,{"$f":"IF(SUM(F17,G17)=0,\"\",SUM(F17,G17))","v":5728},2671,2736,{"$f":"IF(SUM(I17,J17)=0,\"\",SUM(I17,J17))","v":5407},{"$f":"IF(SUM(C17,F17,I17)=0,\"\",SUM(C17,F17,I17))","v":8316},{"$f":"IF(SUM(D17,G17,J17)=0,\"\",SUM(SUM(D17,G17,J17)))","v":8363},{"$f":"IF(SUM(L17,M17)=0,\"\",SUM(L17,M17))","v":16679},105,99,{"$f":"IF(SUM(O17,P17)=0,\"\",SUM(O17,P17))","v":204},112,125,{"$f":"IF(SUM(R17,S17)=0,\"\",SUM(R17,S17))","v":237},58,92,{"$f":"IF(SUM(U17,V17)=0,\"\",SUM(U17,V17))","v":150},{"$f":"IF(SUM(O17,R17,U17)=0,\"\",SUM(O17,R17,U17))","v":275},{"$f":"IF(SUM(P17,S17,V17)=0,\"\",SUM(SUM(P17,S17,V17)))","v":316},{"$f":"IF(SUM(X17,Y17)=0,\"\",SUM(X17,Y17))","v":591}]
[null,"Particulares",547,616,{"$f":"IF(SUM(C18,D18)=0,\"\",SUM(C18,D18))","v":1163},555,612,{"$f":"IF(SUM(F18,G18)=0,\"\",SUM(F18,G18))","v":1167},578,600,{"$f":"IF(SUM(I18,J18)=0,\"\",SUM(I18,J18))","v":1178},{"$f":"IF(SUM(C18,F18,I18)=0,\"\",SUM(C18,F18,I18))","v":1680},{"$f":"IF(SUM(D18,G18,J18)=0,\"\",SUM(SUM(D18,G18,J18)))","v":1828},{"$f":"IF(SUM(L18,M18)=0,\"\",SUM(L18,M18))","v":3508},21,25,{"$f":"IF(SUM(O18,P18)=0,\"\",SUM(O18,P18))","v":46},26,23,{"$f":"IF(SUM(R18,S18)=0,\"\",SUM(R18,S18))","v":49},19,16,{"$f":"IF(SUM(U18,V18)=0,\"\",SUM(U18,V18))","v":35},{"$f":"IF(SUM(O18,R18,U18)=0,\"\",SUM(O18,R18,U18))","v":66},{"$f":"IF(SUM(P18,S18,V18)=0,\"\",SUM(SUM(P18,S18,V18)))","v":64},{"$f":"IF(SUM(X18,Y18)=0,\"\",SUM(X18,Y18))","v":130}]
[null,"Secundaria Técnica",2600,2520,5120,2577,2580,5157,2549,2508,5057,7726,7608,15334,103,101,204,102,109,211,77,85,162,282,295,577]
[null,"Telesecundaria",957,841,1798,906,781,1687,878,845,1723,2741,2467,5208,38,27,65,33,34,67,28,24,52,99,85,184]
[null,null,null,null,{"$f":"IF(SUM(C21,D21)=0,\"\",SUM(C21,D21))","v":""},null,null,{"$f":"IF(SUM(F21,G21)=0,\"\",SUM(F21,G21))","v":""},null,null,{"$f":"IF(SUM(I21,J21)=0,\"\",SUM(I21,J21))","v":""},{"$f":"IF(SUM(C21,F21,I21)=0,\"\",SUM(C21,F21,I21))","v":""},{"$f":"IF(SUM(D21,G21,J21)=0,\"\",SUM(SUM(D21,G21,J21)))","v":""},{"$f":"IF(SUM(L21,M21)=0,\"\",SUM(L21,M21))","v":""},null,null,{"$f":"IF(SUM(O21,P21)=0,\"\",SUM(O21,P21))","v":""},null,null,{"$f":"IF(SUM(R21,S21)=0,\"\",SUM(R21,S21))","v":""},null,null,{"$f":"IF(SUM(U21,V21)=0,\"\",SUM(U21,V21))","v":""},{"$f":"IF(SUM(O21,R21,U21)=0,\"\",SUM(O21,R21,U21))","v":""},{"$f":"IF(SUM(P21,S21,V21)=0,\"\",SUM(SUM(P21,S21,V21)))","v":""},{"$f":"IF(SUM(X21,Y21)=0,\"\",SUM(X21,Y21))","v":""}]
[null,null,null,null,"",null,null,"",null,null,"","","","",null,null,"",null,null,"",null,null,"","","",""]
[null,null,null,null,"",null,null,"",null,null,"","","","",null,null,"",null,null,"",null,null,"","","",""]
[null,null,null,null,"",null,null,"",null,null,"","","","",null,null,"",null,null,"",null,null,"","","",""]
[null,null,null,null,"",null,null,"",null,null,"","","","",null,null,"",null,null,"",null,null,"","","",""]
[null,null,null,null,"",null,null,"",null,null,"","","","",null,null,"",null,null,"",null,null,"","","",""]
[null,"TOTAL",{"$f":"IF(SUM(C17:C26)=0,\"\",SUM(C17:C26))","v":6923},6702,13625,6864,6875,13739,6676,6689,13365,20463,20266,40729,267,252,519,273,291,564,182,217,399,722,760,1482]
[]
[null,"Modalidad","BAJAS",null,null,null,null,null,null,null,null,null,null,null,null,null,null,null,null,null,null,null,null,null,null,null,"EXISTENCIA"]
[null,null,"DESERCIÓN",null,null,null,null,null,null,null,null,null,null,null,"CAMBIOS HACIA OTRAS ESCUELAS (TRASLADOS)"]
[null,null,"PRIMERO",null,null,"SEGUNDO",null,null,"TERCERO",null,null,"TOTAL",null,null,"PRIMERO",null,null,"SEGUNDO",null,null,"TERCERO",null,null,"TOTAL",null,null,"PRIMERO",null,null,"SEGUNDO",null,null,"TERCERO",null,null,"TOTAL"]
[null,null,"H","M","T","H","M","T","H","M","T","H","M","T","H","M","T","H","M","T","H","M","T","H","M","T","H","M","T","H","M","T","H","M","T","H","M","T"]
[null,{"$f":"IF(B17=0,\"\",B17)","v":"Generales Públicas"},47,48,{"$f":"IF(SUM(C33,D33)=0,\"\",SUM(C33,D33))","v":95},38,38,{"$f":"IF(SUM(F33,G33)=0,\"\",SUM(F33,G33))","v":76},41,30,{"$f":"IF(SUM(I33,J33)=0,\"\",SUM(I33,J33))","v":71},{"$f":"IF(SUM(C33,F33,I33)=0,\"\",SUM(C33,F33,I33))","v":126},{"$f":"IF(SUM(D33,G33,J33)=0,\"\",SUM(SUM(D33,G33,J33)))","v":116},{"$f":"IF(SUM(L33,M33)=0,\"\",SUM(L33,M33))","v":242},104,105,{"$f":"IF(SUM(O33,P33)=0,\"\",SUM(O33,P33))","v":209},113,147,{"$f":"IF(SUM(R33,S33)=0,\"\",SUM(R33,S33))","v":260},100,101,{"$f":"IF(SUM(U33,V33)=0,\"\",SUM(U33,V33))","v":201},{"$f":"IF(SUM(O33,R33,U33)=0,\"\",SUM(O33,R33,U33))","v":317},{"$f":"IF(SUM(P33,S33,V33)=0,\"\",SUM(SUM(P33,S33,V33)))","v":353},{"$f":"IF(SUM(X33,Y33)=0,\"\",SUM(X33,Y33))","v":670},{"$f":"IF(SUM(C17,O17-C33-O33)=0,\"\",SUM(C17,O17-C33-O33))","v":2773},{"$f":"IF(SUM(D17,P17-D33-P33)=0,\"\",SUM(D17,P17-D33-P33))","v":2671},{"$f":"IF(SUM(AA33,AB33)=0,\"\",SUM(AA33,AB33))","v":5444},{"$f":"IF(SUM(F17,R17-F33-R33)=0,\"\",SUM(F17,R17-F33-R33))","v":2787},{"$f":"IF(SUM(G17,S17-G33-S33)=0,\"\",SUM(G17,S17-G33-S33))","v":2842},{"$f":"IF(SUM(AD33,AE33)=0,\"\",SUM(AD33,AE33))","v":5629},{"$f":"IF(SUM(I17,U17-I33-U33)=0,\"\",SUM(I17,U17-I33-U33))","v":2588},{"$f":"IF(SUM(J17,V17-J33-V33)=0,\"\",SUM(J17,V17-J33-V33))","v":2697},{"$f":"IF(SUM(AG33,AH33)=0,\"\",SUM(AG33,AH33))","v":5285},{"$f":"IF(SUM(AA33,AD33,AG33)=0,\"\",SUM(AA33,AD33,AG33))","v":8148},{"$f":"IF(SUM(AB33,AE33,AH33)=0,\"\",SUM(SUM(AB33,AE33,AH33)))","v":8210},{"$f":"IF(SUM(AJ33,AK33)=0,\"\",SUM(AJ33,AK33))","v":16358}]
[null,"Particulares",1,1,{"$f":"IF(SUM(C34,D34)=0,\"\",SUM(C34,D34))","v":2},1,1,{"$f":"IF(SUM(F34,G34)=0,\"\",SUM(F34,G34))","v":2},null,3,{"$f":"IF(SUM(I34,J34)=0,\"\",SUM(I34,J34))","v":3},{"$f":"IF(SUM(C34,F34,I34)=0,\"\",SUM(C34,F34,I34))","v":2},{"$f":"IF(SUM(D34,G34,J34)=0,\"\",SUM(SUM(D34,G34,J34)))","v":5},{"$f":"IF(SUM(L34,M34)=0,\"\",SUM(L34,M34))","v":7},14,8,{"$f":"IF(SUM(O34,P34)=0,\"\",SUM(O34,P34))","v":22},8,13,{"$f":"IF(SUM(R34,S34)=0,\"\",SUM(R34,S34))","v":21},6,12,{"$f":"IF(SUM(U34,V34)=0,\"\",SUM(U34,V34))","v":18},{"$f":"IF(SUM(O34,R34,U34)=0,\"\",SUM(O34,R34,U34))","v":28},{"$f":"IF(SUM(P34,S34,V34)=0,\"\",SUM(SUM(P34,S34,V34)))","v":33},{"$f":"IF(SUM(X34,Y34)=0,\"\",SUM(X34,Y34))","v":61},{"$f":"IF(SUM(C18,O18-C34-O34)=0,\"\",SUM(C18,O18-C34-O34))","v":553},632,1185,{"$f":"IF(SUM(F18,R18-F34-R34)=0,\"\",SUM(F18,R18-F34-R34))","v":572},{"$f":"IF(SUM(G18,S18-G34-S34)=0,\"\",SUM(G18,S18-G34-S34))","v":621},{"$f":"IF(SUM(AD34,AE34)=0,\"\",SUM(AD34,AE34))","v":1193},{"$f":"IF(SUM(I18,U18-I34-U34)=0,\"\",SUM(I18,U18-I34-U34))","v":591},{"$f":"IF(SUM(J18,V18-J34-V34)=0,\"\",SUM(J18,V18-J34-V34))","v":601},{"$f":"IF(SUM(AG34,AH34)=0,\"\",SUM(AG34,AH34))","v":1192},{"$f":"IF(SUM(AA34,AD34,AG34)=0,\"\",SUM(AA34,AD34,AG34))","v":1716},{"$f":"IF(SUM(AB34,AE34,AH34)=0,\"\",SUM(SUM(AB34,AE34,AH34)))","v":1854},{"$f":"IF(SUM(AJ34,AK34)=0,\"\",SUM(AJ34,AK34))","v":3570}]
[null,{"$f":"IF(B19=0,\"\",B19)","v":"Secundaria Técnica"},18,12,30,28,18,46,34,20,54,80,50,130,127,114,241,101,111,212,94,100,194,322,325,647,2558,2495,5053,{"$f":"IF(SUM(F19,R19-F35-R35)=0,\"\",SUM(F19,R19-F35-R35))","v":2550},2560,5110,{"$f":"IF(SUM(I19,U19-I35-U35)=0,\"\",SUM(I19,U19-I35-U35))","v":2498},2473,4971,7606,7528,15134]
[null,"Telesecundaria",24,11,35,33,12,45,28,16,44,85,39,124,47,37,84,50,47,97,46,36,82,143,120,263,924,820,1744,856,756,1612,832,817,1649,2612,2393,5005]
[null,"",null,null,{"$f":"IF(SUM(C37,D37)=0,\"\",SUM(C37,D37))","v":""},null,null,{"$f":"IF(SUM(F37,G37)=0,\"\",SUM(F37,G37))","v":""},null,null,{"$f":"IF(SUM(I37,J37)=0,\"\",SUM(I37,J37))","v":""},{"$f":"IF(SUM(C37,F37,I37)=0,\"\",SUM(C37,F37,I37))","v":""},{"$f":"IF(SUM(D37,G37,J37)=0,\"\",SUM(SUM(D37,G37,J37)))","v":""},{"$f":"IF(SUM(L37,M37)=0,\"\",SUM(L37,M37))","v":""},null,null,{"$f":"IF(SUM(O37,P37)=0,\"\",SUM(O37,P37))","v":""},null,null,{"$f":"IF(SUM(R37,S37)=0,\"\",SUM(R37,S37))","v":""},null,null,{"$f":"IF(SUM(U37,V37)=0,\"\",SUM(U37,V37))","v":""},{"$f":"IF(SUM(O37,R37,U37)=0,\"\",SUM(O37,R37,U37))","v":""},{"$f":"IF(SUM(P37,S37,V37)=0,\"\",SUM(SUM(P37,S37,V37)))","v":""},{"$f":"IF(SUM(X37,Y37)=0,\"\",SUM(X37,Y37))","v":""},"","",{"$f":"IF(SUM(AA37,AB37)=0,\"\",SUM(AA37,AB37))","v":""},"","",{"$f":"IF(SUM(AD37,AE37)=0,\"\",SUM(AD37,AE37))","v":""},"","",{"$f":"IF(SUM(AG37,AH37)=0,\"\",SUM(AG37,AH37))","v":""},{"$f":"IF(SUM(AA37,AD37,AG37)=0,\"\",SUM(AA37,AD37,AG37))","v":""},{"$f":"IF(SUM(AB37,AE37,AH37)=0,\"\",SUM(SUM(AB37,AE37,AH37)))","v":""},{"$f":"IF(SUM(AJ37,AK37)=0,\"\",SUM(AJ37,AK37))","v":""}]
[null,"",null,null,"",null,null,"",null,null,"","","","",null,null,"",null,null,"",null,null,"","","","","","","","","","","","","","","",""]
[null,"",null,null,"",null,null,"",null,null,"","","","",null,null,"",null,null,"",null,null,"","","","","","","","","","","","","","","",""]
[null,"",null,null,"",null,null,"",null,null,"","","","",null,null,"",null,null,"",null,null,"","","","","","","","","","","","","","","",""]
[null,"",null,null,"",null,null,"",null,null,"","","","",null,null,"",null,null,"",null,null,"","","","","","","","","","","","","","","",""]
[null,"",null,null,"",null,null,"",null,null,"","","","",null,null,"",null,null,"",null,null,"","","","","","","","","","","","","","","",""]
[null,"TOTAL",{"$f":"IF(SUM(C33:C42)=0,\"\",SUM(C33:C42))","v":90},72,162,100,69,169,103,69,172,293,210,503,292,264,556,272,318,590,246,249,495,810,831,1641,6808,6618,13426,6765,6779,13544,6509,6588,13097,20082,19985,40067]

{"sheet":"APROV 1","index":1,"n_rows":43,"n_cols":33,"rows_kept":43,"cut":false,"hidden":false,"merged":[[6,1,6,12],[7,1,7,12],[6,13,6,25],[7,13,7,25],[28,1,28,3],[28,0,29,0],[28,4,28,6],[28,7,28,9],[28,16,28,18],[28,22,28,24],[25,1,25,3],[25,7,25,9],[25,4,25,6],[27,25,27,30],[14,4,14,6],[12,25,12,30],[14,22,14,24],[15,1,15,3],[15,4,15,6],[15,7,15,9],[15,10,15,12],[14,19,14,21],[14,1,14,3],[14,10,14,12],[27,31,27,32],[25,28,25,30],[28,28,28,30],[28,10,28,12],[28,13,28,15],[28,19,28,21],[28,25,28,27],[28,31,28,32],[25,10,25,12],[25,13,25,15],[25,31,25,32],[25,16,25,18],[12,31,12,32],[14,13,14,15],[22,13,22,15],[23,13,23,15],[13,28,13,30],[14,28,14,30],[22,28,22,30],[23,28,23,30],[12,0,12,24],[22,19,22,21],[23,19,23,21],[14,31,14,32],[13,31,13,32],[13,0,14,0],[13,1,13,3],[13,4,13,6],[13,7,13,9],[13,10,13,12],[13,13,13,15],[13,16,13,18],[13,25,13,27],[14,25,14,27],[14,16,14,18],[13,22,13,24],[14,7,14,9],[13,19,13,21],[23,1,23,3],[25,19,25,21],[25,25,25,27],[25,22,25,24],[24,25,24,27],[23,25,23,27],[22,7,22,9],[22,22,22,24],[23,22,23,24],[24,22,24,24],[22,16,22,18],[23,16,23,18],[24,16,24,18],[24,19,24,21],[23,7,23,9],[24,7,24,9],[24,1,24,3],[24,13,24,15],[16,1,16,3],[16,4,16,6],[16,7,16,9],[16,10,16,12],[42,0,44,32],[45,0,72,32],[0,0,0,32],[2,1,2,29],[3,1,3,29],[4,1,4,29],[5,1,5,29],[10,0,10,2],[27,0,27,24],[22,10,22,12],[23,10,23,12],[24,10,24,12],[22,25,22,27],[23,31,23,32],[24,31,24,32],[24,28,24,30],[17,28,17,30],[17,31,17,32],[18,28,18,30],[22,4,22,6],[23,4,23,6],[24,4,24,6],[22,31,22,32],[22,1,22,3],[18,31,18,32],[19,28,19,30],[19,31,19,32],[20,28,20,30],[20,31,20,32],[21,28,21,30],[21,31,21,32],[15,13,15,15],[15,16,15,18],[15,19,15,21],[15,22,15,24],[15,25,15,27],[15,28,15,30],[15,31,15,32],[16,28,16,30],[16,31,16,32],[16,13,16,15],[16,16,16,18],[16,19,16,21],[16,22,16,24],[16,25,16,27],[19,25,19,27],[20,10,20,12],[20,13,20,15],[20,16,20,18],[20,19,20,21],[20,22,20,24],[20,25,20,27],[17,1,17,3],[17,4,17,6],[17,7,17,9],[17,10,17,12],[17,13,17,15],[17,16,17,18],[17,19,17,21],[17,22,17,24],[17,25,17,27],[18,1,18,3],[18,4,18,6],[18,7,18,9],[18,10,18,12],[18,13,18,15],[18,16,18,18],[18,19,18,21],[18,22,18,24],[18,25,18,27],[9,0,9,5],[10,7,10,25],[10,26,10,30],[9,7,9,25],[21,1,21,3],[21,4,21,6],[21,7,21,9],[21,10,21,12],[21,13,21,15],[21,16,21,18],[21,19,21,21],[21,22,21,24],[21,25,21,27],[19,1,19,3],[19,4,19,6],[19,7,19,9],[19,10,19,12],[19,13,19,15],[19,16,19,18],[19,19,19,21],[19,22,19,24],[20,1,20,3],[20,4,20,6],[20,7,20,9]]}
[]
[]
[null,"Secretaría de Educación Pública del Estado de Baja California Sur"]
[null,"Dirección de Educación Secundaria"]
[null,"APROVECHAMIENTO Y RIESGO DE NO ACREDITAR"]
[null,"PRIMER GRADO "]
[null,"PERIODO EVALUACIÓN:",null,null,null,null,null,null,null,null,null,null,null,{"$f":"IF(MATRICULA!O6=0,\"\",MATRICULA!O6)","v":"CONCENTRADO FINAL"}]
[null,"CICLO ESCOLAR :",null,null,null,null,null,null,null,null,null,null,null,{"$f":"IF(MATRICULA!O7=0,\"\",MATRICULA!O7)","v":"2021-2022"}]
[]
["DIRECCIÓN: ",null,null,null,null,null,null,"EDUCACIÓN SECUNDARIA"]
["DIRECTORA:",null,null,null,null,null,null,"MTRA. OFELIA ELIZABETH OCHOA ROMERO"]
[]
["Promedio de Aprovechamiento de los Campos de Formación Académica",null,null,null,null,null,null,null,null,null,null,null,null,null,null,null,null,null,null,null,null,null,null,null,null,"Promedio de Aprovechamiento de las Áreas de Desarrollo Personal y Social"]
["Modalidad","Lengua Materna ",null,null,"Matemáticas",null,null,"Inglés",null,null,"Ciencias y tecnología (Biología)",null,null,"Historia",null,null,"Geografía",null,null,"Formación Cívica y Ética",null,null,"Tecnología I",null,null,"Educación Física",null,null,"Artes",null,null,"Prom. Final"]
[null,"CALIF",null,null,"CALIF",null,null,"CALIF",null,null,"CALIF",null,null,"CALIF",null,null,"CALIF",null,null,"CALIF",null,null,"CALIF",null,null,"CALIF",null,null,"CALIF",null,null,"CALIF"]
[{"$f":"IF(MATRICULA!B17=0,\"\",MATRICULA!B17)","v":"Generales Públicas"},8.6,null,null,8.4,null,null,8.6999999999999993,null,null,8.8000000000000007,null,null,8.6999999999999993,null,null,8.6999999999999993,null,null,8.8000000000000007,null,null,9,null,null,9.3000000000000007,null,null,9,null,null,{"$f":"IFERROR(ROUND(AVERAGE(B16:AE16),1),\"\")","v":8.8000000000000007}]
[{"$f":"IF(MATRICULA!B18=0,\"\",MATRICULA!B18)","v":"Particulares"},8.6999999999999993,null,null,8.6,null,null,8.8000000000000007,null,null,9,null,null,8.9,null,null,8.9,null,null,9.1,null,null,9.1,null,null,9.6,null,null,9.5,null,null,{"$f":"IFERROR(ROUND(AVERAGE(B17:AE17),1),\"\")","v":9}]
["Secundarias Técnicas",8.4,null,null,8.5,null,null,8.6,null,null,8.6,null,null,8.4,null,null,8.6,null,null,8.6,null,null,8.6999999999999993,null,null,9.3000000000000007,null,null,8.9,null,null,8.6999999999999993]
[{"$f":"IF(MATRICULA!B20=0,\"\",MATRICULA!B20)","v":"Telesecundaria"},8.3000000000000007,null,null,8.1,null,null,8.4,null,null,8.4,null,null,8.3000000000000007,null,null,8.3000000000000007,null,null,8.6999999999999993,null,null,9,null,null,9.1999999999999993,null,null,9,null,null,8.6]
[{"$f":"IF(MATRICULA!B21=0,\"\",MATRICULA!B21)","v":""},null,null,null,null,null,null,null,null,null,null,null,null,null,null,null,null,null,null,null,null,null,null,null,null,null,null,null,null,null,null,""]
[{"$f":"IF(MATRICULA!B22=0,\"\",MATRICULA!B22)","v":""},null,null,null,null,null,null,null,null,null,null,null,null,null,null,null,null,null,null,null,null,null,null,null,null,null,null,null,null,null,null,""]
[{"$f":"IF(MATRICULA!B23=0,\"\",MATRICULA!B23)","v":""},null,null,null,null,null,null,null,null,null,null,null,null,null,null,null,null,null,null,null,null,null,null,null,null,null,null,null,null,null,null,""]
[{"$f":"IF(MATRICULA!B24=0,\"\",MATRICULA!B24)","v":""},null,null,null,null,null,null,null,null,null,null,null,null,null,null,null,null,null,null,null,null,null,null,null,null,null,null,null,null,null,null,""]
[{"$f":"IF(MATRICULA!B25=0,\"\",MATRICULA!B25)","v":""},null,null,null,null,null,null,null,null,null,null,null,null,null,null,null,null,null,null,null,null,null,null,null,null,null,null,null,null,null,null,""]
[{"$f":"IF(MATRICULA!B26=0,\"\",MATRICULA!B26)","v":""},null,null,null,null,null,null,null,null,null,null,null,null,null,null,null,null,null,null,null,null,null,null,null,null,null,null,null,null,null,null,""]
["Gral.",{"$f":"IFERROR(ROUND(AVERAGE(B16:D25),1),\"\")","v":8.5},null,null,{"$f":"IFERROR(ROUND(AVERAGE(E16:G25),1),\"\")","v":8.4},null,null,{"$f":"IFERROR(ROUND(AVERAGE(H16:J25),1),\"\")","v":8.6},null,null,{"$f":"IFERROR(ROUND(AVERAGE(K16:M25),1),\"\")","v":8.6999999999999993},null,null,{"$f":"IFERROR(ROUND(AVERAGE(N16:P25),1),\"\")","v":8.6},null,null,{"$f":"IFERROR(ROUND(AVERAGE(Q16:S25),1),\"\")","v":8.6},null,null,{"$f":"IFERROR(ROUND(AVERAGE(T16:V25),1),\"\")","v":8.8000000000000007},null,null,{"$f":"IFERROR(ROUND(AVERAGE(W16:Y25),1),\"\")","v":9},null,null,{"$f":"IFERROR(ROUND(AVERAGE(Z16:AB25),1),\"\")","v":9.4},null,null,{"$f":"IFERROR(ROUND(AVERAGE(AC16:AE25),1),\"\")","v":9.1},null,null,{"$f":"IFERROR(ROUND(AVERAGE(AF16:AG25),1),\"\")","v":8.8000000000000007}]
[]
["Campos de Formación Académica en riesgo de no acreditar",null,null,null,null,null,null,null,null,null,null,null,null,null,null,null,null,null,null,null,null,null,null,null,null,"Áreas de Desarrollo Personal y Social en situación de riesgo de no acreditar"]
["Modalidad","Lengua Materna",null,null,"Matemáticas",null,null,"Inglés",null,null,"Ciencias y tecnología (Biología)",null,null,"Historia",null,null,"Geografía",null,null,"Formación Cívica y Ética",null,null,"Tecnología I",null,null,"Educación Física",null,null,"Artes",null,null,"Total"]
[null,5,6,"T",5,6,"T",5,6,"T",5,6,"T",5,6,"T",5,6,"T",5,6,"T",5,6,"T",5,6,"T",5,6,"T",5,6]
[{"$f":"IF(MATRICULA!B17=0,\"\",MATRICULA!B17)","v":"Generales Públicas"},null,364,{"$f":"IF(SUM(B31,C31)=0,\"\",SUM(B31,C31))","v":364},null,588,{"$f":"IF(SUM(E31,F31)=0,\"\",SUM(E31,F31))","v":588},null,423,{"$f":"IF(SUM(H31,I31)=0,\"\",SUM(H31,I31))","v":423},null,317,{"$f":"IF(SUM(K31,L31)=0,\"\",SUM(K31,L31))","v":317},null,316,{"$f":"IF(SUM(N31,O31)=0,\"\",SUM(N31,O31))","v":316},null,366,{"$f":"IF(SUM(Q31,R31)=0,\"\",SUM(Q31,R31))","v":366},null,223,{"$f":"IF(SUM(T31,U31)=0,\"\",SUM(T31,U31))","v":223},null,255,{"$f":"IF(SUM(W31,X31)=0,\"\",SUM(W31,X31))","v":255},null,132,{"$f":"IF(SUM(Z31,AA31)=0,\"\",SUM(Z31,AA31))","v":132},null,294,{"$f":"IF(SUM(AC31,AD31)=0,\"\",SUM(AC31,AD31))","v":294},{"$f":"IF(SUM(B31,E31,H31,K31,N31,Q31,T31,W31,Z31,AC31)=0,\"\",SUM(B31,E31,H31,K31,N31,Q31,T31,W31,Z31,AC31))","v":""},{"$f":"IF(SUM(C31,F31,I31,L31,O31,R31,U31,X31,AA31,AD31)=0,\"\",SUM(C31,F31,I31,L31,O31,R31,U31,X31,AA31,AD31))","v":3278}]
[{"$f":"IF(MATRICULA!B18=0,\"\",MATRICULA!B18)","v":"Particulares"},null,67,{"$f":"IF(SUM(B32,C32)=0,\"\",SUM(B32,C32))","v":67},null,81,{"$f":"IF(SUM(E32,F32)=0,\"\",SUM(E32,F32))","v":81},null,66,{"$f":"IF(SUM(H32,I32)=0,\"\",SUM(H32,I32))","v":66},null,20,{"$f":"IF(SUM(K32,L32)=0,\"\",SUM(K32,L32))","v":20},null,32,{"$f":"IF(SUM(N32,O32)=0,\"\",SUM(N32,O32))","v":32},null,41,{"$f":"IF(SUM(Q32,R32)=0,\"\",SUM(Q32,R32))","v":41},null,35,{"$f":"IF(SUM(T32,U32)=0,\"\",SUM(T32,U32))","v":35},null,60,{"$f":"IF(SUM(W32,X32)=0,\"\",SUM(W32,X32))","v":60},null,10,{"$f":"IF(SUM(Z32,AA32)=0,\"\",SUM(Z32,AA32))","v":10},null,19,{"$f":"IF(SUM(AC32,AD32)=0,\"\",SUM(AC32,AD32))","v":19},{"$f":"IF(SUM(B32,E32,H32,K32,N32,Q32,T32,W32,Z32,AC32)=0,\"\",SUM(B32,E32,H32,K32,N32,Q32,T32,W32,Z32,AC32))","v":""},{"$f":"IF(SUM(C32,F32,I32,L32,O32,R32,U32,X32,AA32,AD32)=0,\"\",SUM(C32,F32,I32,L32,O32,R32,U32,X32,AA32,AD32))","v":431}]
[{"$f":"IF(MATRICULA!B19=0,\"\",MATRICULA!B19)","v":"Secundaria Técnica"},null,425,425,null,422,422,null,417,417,null,410,410,null,499,499,null,336,336,null,492,492,null,383,383,null,58,58,null,176,176,"",3618]
[{"$f":"IF(MATRICULA!B20=0,\"\",MATRICULA!B20)","v":"Telesecundaria"},null,378,378,null,413,413,null,367,367,null,367,367,null,443,443,null,359,359,null,327,327,null,302,302,null,344,344,null,239,239,"",3539]
[{"$f":"IF(MATRICULA!B21=0,\"\",MATRICULA!B21)","v":""},null,null,"",null,null,"",null,null,"",null,null,"",null,null,"",null,null,"",null,null,"",null,null,"",null,null,"",null,null,"","",""]
[{"$f":"IF(MATRICULA!B22=0,\"\",MATRICULA!B22)","v":""},null,null,"",null,null,"",null,null,"",null,null,"",null,null,"",null,null,"",null,null,"",null,null,"",null,null,"",null,null,"","",""]
[{"$f":"IF(MATRICULA!B23=0,\"\",MATRICULA!B23)","v":""},null,null,"",null,null,"",null,null,"",null,null,"",null,null,"",null,null,"",null,null,"",null,null,"",null,null,"",null,null,"","",""]
[{"$f":"IF(MATRICULA!B24=0,\"\",MATRICULA!B24)","v":""},null,null,{"$f":"IF(SUM(B38,C38)=0,\"\",SUM(B38,C38))","v":""},null,null,{"$f":"IF(SUM(E38,F38)=0,\"\",SUM(E38,F38))","v":""},null,null,{"$f":"IF(SUM(H38,I38)=0,\"\",SUM(H38,I38))","v":""},null,null,{"$f":"IF(SUM(K38,L38)=0,\"\",SUM(K38,L38))","v":""},null,null,{"$f":"IF(SUM(N38,O38)=0,\"\",SUM(N38,O38))","v":""},null,null,{"$f":"IF(SUM(Q38,R38)=0,\"\",SUM(Q38,R38))","v":""},null,null,{"$f":"IF(SUM(T38,U38)=0,\"\",SUM(T38,U38))","v":""},null,null,{"$f":"IF(SUM(W38,X38)=0,\"\",SUM(W38,X38))","v":""},null,null,{"$f":"IF(SUM(Z38,AA38)=0,\"\",SUM(Z38,AA38))","v":""},null,null,{"$f":"IF(SUM(AC38,AD38)=0,\"\",SUM(AC38,AD38))","v":""},{"$f":"IF(SUM(B38,E38,H38,K38,N38,Q38,T38,W38,Z38,AC38)=0,\"\",SUM(B38,E38,H38,K38,N38,Q38,T38,W38,Z38,AC38))","v":""},{"$f":"IF(SUM(C38,F38,I38,L38,O38,R38,U38,X38,AA38,AD38)=0,\"\",SUM(C38,F38,I38,L38,O38,R38,U38,X38,AA38,AD38))","v":""}]
[{"$f":"IF(MATRICULA!B25=0,\"\",MATRICULA!B25)","v":""},null,null,{"$f":"IF(SUM(B39,C39)=0,\"\",SUM(B39,C39))","v":""},null,null,{"$f":"IF(SUM(E39,F39)=0,\"\",SUM(E39,F39))","v":""},null,null,{"$f":"IF(SUM(H39,I39)=0,\"\",SUM(H39,I39))","v":""},null,null,{"$f":"IF(SUM(K39,L39)=0,\"\",SUM(K39,L39))","v":""},null,null,{"$f":"IF(SUM(N39,O39)=0,\"\",SUM(N39,O39))","v":""},null,null,{"$f":"IF(SUM(Q39,R39)=0,\"\",SUM(Q39,R39))","v":""},null,null,{"$f":"IF(SUM(T39,U39)=0,\"\",SUM(T39,U39))","v":""},null,null,{"$f":"IF(SUM(W39,X39)=0,\"\",SUM(W39,X39))","v":""},null,null,{"$f":"IF(SUM(Z39,AA39)=0,\"\",SUM(Z39,AA39))","v":""},null,null,{"$f":"IF(SUM(AC39,AD39)=0,\"\",SUM(AC39,AD39))","v":""},{"$f":"IF(SUM(B39,E39,H39,K39,N39,Q39,T39,W39,Z39,AC39)=0,\"\",SUM(B39,E39,H39,K39,N39,Q39,T39,W39,Z39,AC39))","v":""},{"$f":"IF(SUM(C39,F39,I39,L39,O39,R39,U39,X39,AA39,AD39)=0,\"\",SUM(C39,F39,I39,L39,O39,R39,U39,X39,AA39,AD39))","v":""}]
[{"$f":"IF(MATRICULA!B26=0,\"\",MATRICULA!B26)","v":""},null,null,"",null,null,"",null,null,"",null,null,"",null,null,"",null,null,"",null,null,"",null,null,"",null,null,"",null,null,"","",""]
["Total",{"$f":"IF(SUM(B31:B40)=0,\"\",SUM(B31:B40))","v":""},1234,1234,"",1504,1504,"",1273,1273,"",1114,1114,"",1290,1290,"",1102,1102,"",1077,1077,"",1000,1000,"",544,544,"",728,728,"",10866]
[]
["Nota: Para las columnas \"Campos de Formación Académica y Áreas de Desarrollo Personal y Social en riesgo de no acreditar\" registre la cantidad de cincos o seis que existen en cada campo o área."]

{"sheet":"R6","index":2,"n_rows":23,"n_cols":8,"rows_kept":23,"cut":false,"hidden":false,"merged":[[6,1,6,6],[0,0,0,7],[2,1,2,6],[3,1,3,6],[4,1,4,6],[5,1,5,6],[12,2,13,7],[11,0,11,1],[12,0,12,1],[15,0,15,7],[11,2,11,7],[14,0,14,1],[13,0,13,1]]}
[]
[]
[null,"Secretaría de Educación Pública del Estado de Baja California Sur"]
[null,"Dirección de Educación Secundaria"]
[]
[null,"REGISTRO DE ALUMNOS CON CALIFICACIÓN \"6\" EN UNA O MÁS ASIGNATURAS"]
[null,"PRIMER GRADO"]
[]
[null,null,"PERIODO DE EVALUACIÓN:",null,{"$f":"MATRICULA!O6","v":"CONCENTRADO FINAL"}]
[null,null,"CICLO ESCOLAR:",null,{"$f":"IF([1]MATRICULA!O7=0,\"\",[1]MATRICULA!O7)","v":"2021-2022"}]
[]
["DIRECCIÓN:",null,{"$f":"MATRICULA!I10","v":"EDUCACIÓN SECUNDARIA"}]
[null,null,{"$f":"MATRICULA!I11","v":"MTRA. OFELIA ELIZABETH OCHOA ROMERO"}]
["DIRECTORA:"]
[]
["REGISTRAR LA CANTIDAD DE ALUMNOS CON CALIFICACIÓN \"6\" EN UNA O MÁS ASIGNATURAS SEGÚN CORRESPONDA"]
["Modalidad","1 ASIGNATURA","2  ASIGNATURAS","3  ASIGNATURAS","4  ASIGNATURAS","5  ASIGNATURAS","6 O MÁS  ASIGNATURAS","TOTAL"]
["Generales Públicas",400,330,166,96,56,161,1209]
["Particulares",68,50,15,13,15,34,195]
["Secundaria Técnica",426,240,168,89,174,373,1470]
["Telesecundaria",102,71,49,49,32,171,{"$f":"SUM(B21:G21)","v":474}]
[{"$f":"IF([1]MATRICULA!B26=0,\"\",[1]MATRICULA!B26)","v":""},null,null,null,null,null,null,{"$f":"IF(SUM(B22:G22)=0,\"\",SUM(B22:G22))","v":""}]
["TOTAL",{"$f":"IF(SUM(B18:B22)=0,\"\",SUM(B18:B22))","v":996},691,398,247,277,739,3348]

{"sheet":"PARTICIPACIÓN 1","index":3,"n_rows":27,"n_cols":31,"rows_kept":27,"cut":false,"hidden":false,"merged":[[26,30,26,32],[10,0,10,5],[26,0,26,2],[26,7,26,10],[26,15,26,18],[23,23,23,26],[23,30,23,32],[25,0,25,2],[25,7,25,10],[25,15,25,18],[25,23,25,26],[25,30,25,32],[23,0,23,2],[23,7,23,10],[21,23,21,26],[21,30,21,32],[22,0,22,2],[22,7,22,10],[22,15,22,18],[22,23,22,26],[22,30,22,32],[13,0,13,32],[10,7,10,25],[11,0,11,2],[11,7,11,25],[16,0,16,2],[16,7,16,10],[16,15,16,18],[16,23,16,26],[16,30,16,32],[16,27,16,29],[14,30,15,32],[14,23,15,26],[14,15,15,18],[14,7,15,10],[14,0,15,2],[7,13,7,25],[0,0,0,32],[2,1,2,30],[3,1,3,30],[4,1,4,30],[5,1,5,30],[6,13,6,25],[6,1,6,11],[7,1,7,11],[17,30,17,32],[18,0,18,2],[18,23,18,26],[18,30,18,32],[17,0,17,2],[17,7,17,10],[17,15,17,18],[17,27,17,29],[18,27,18,29],[18,7,18,10],[18,15,18,18],[17,19,17,22],[18,19,18,22],[17,3,17,6],[18,3,18,6],[24,30,24,32],[20,30,20,32],[19,0,19,2],[19,7,19,10],[19,15,19,18],[19,23,19,26],[19,30,19,32],[19,27,19,29],[21,27,21,29],[22,27,22,29],[20,27,20,29],[21,0,21,2],[21,7,21,10],[21,15,21,18],[20,0,20,2],[20,7,20,10],[20,15,20,18],[20,23,20,26],[23,27,23,29],[24,27,24,29],[25,27,25,29],[26,27,26,29],[14,27,15,29],[14,3,15,6],[14,11,15,14],[23,15,23,18],[24,0,24,2],[24,7,24,10],[24,15,24,18],[24,23,24,26],[17,23,17,26],[14,19,15,22],[16,19,16,22],[16,3,16,6],[26,23,26,26],[16,11,16,14],[17,11,17,14],[18,11,18,14],[19,11,19,14],[20,11,20,14],[21,11,21,14],[22,11,22,14],[23,11,23,14],[24,11,24,14],[26,19,26,22],[19,3,19,6],[20,3,20,6],[21,3,21,6],[22,3,22,6],[23,3,23,6],[24,3,24,6],[25,3,25,6],[26,3,26,6],[26,11,26,14],[19,19,19,22],[20,19,20,22],[21,19,21,22],[22,19,22,22],[23,19,23,22],[24,19,24,22],[25,19,25,22],[25,11,25,14]]}
[]
[]
[null,"Secretaría de Educación Pública del Estado de Baja California Sur"]
[null,"Dirección de Educación Secundaria"]
[null,"NIVELES DE COMUNICACIÓN Y PARTICIPACIÓN DE ALUMNOS"]
[null,"PRIMER GRADO "]
[null,"PERIODO EVALUACIÓN:",null,null,null,null,null,null,null,null,null,null,null,{"$f":"IF('APROV 1'!N7:Z7<>0,'APROV 1'!N7:Z7, \"\")","v":"CONCENTRADO FINAL"}]
[null,"CICLO ESCOLAR :",null,null,null,null,null,null,null,null,null,null,null,{"$f":"IF('APROV 1'!N8:Z8<>0, 'APROV 1'!N8:Z8, \"\")","v":"2021-2022"}]
[]
[]
["DIRECCIÓN: ",null,null,null,null,null,null,"EDUCACIÓN SECUNDARIA"]
["DIRECTORA:",null,null,null,null,null,null,"MTRA. OFELIA ELIZABETH OCHOA ROMERO"]
[]
[" COMUNICACIÓN Y PARTICIPACIÓN CON ALUMNOS  (Registrar cantidad de alumnos)"]
["Modalidad",null,null,"COMUNICACIÓN Y PARTICIPACIÓN SOSTENIDA",null,null,null,"%",null,null,null,"COMUNICACIÓN Y PARTICIPACIÓN INTERMITENTE",null,null,null,"%",null,null,null,"COMUNICACIÓN PRACTICAMENTE INEXISTENTE",null,null,null,"%",null,null,null,"TOTAL",null,null,"MATRÍCULA\nEXISTENCIA"]
[]
[{"$f":"IF(MATRICULA!B17=0,\"\",MATRICULA!B17)","v":"Generales Públicas"},null,null,5161,null,null,null,{"$f":"IFERROR((D17+E17+F17)/AE17*100,\"\")","v":94.801616458486407},null,null,null,238,null,null,null,{"$f":"IFERROR((L17+M17+N17)/AE17*100,\"\")","v":4.3717854518736221},null,null,null,45,null,null,null,{"$f":"IFERROR((T17+U17+V17)/AE17*100,\"\")","v":0.8265980896399705},null,null,null,{"$f":"IF(SUM(D17:G17,L17:O17,T17:W17)=0,\"\",SUM(D17:G17,L17:O17,T17:W17))","v":5444},null,null,{"$f":"IF(MATRICULA!AC33=0,\"\",MATRICULA!AC33)","v":5444}]
[{"$f":"IF(MATRICULA!B18=0,\"\",MATRICULA!B18)","v":"Particulares"},null,null,1179,null,null,null,{"$f":"IFERROR((D18+E18+F18)/AE18*100,\"\")","v":99.493670886075947},null,null,null,6,null,null,null,{"$f":"IFERROR((L18+M18+N18)/AE18*100,\"\")","v":0.50632911392405067},null,null,null,0,null,null,null,{"$f":"IFERROR((T18+U18+V18)/AE18*100,\"\")","v":0},null,null,null,{"$f":"IF(SUM(D18:G18,L18:O18,T18:W18)=0,\"\",SUM(D18:G18,L18:O18,T18:W18))","v":1185},null,null,{"$f":"IF(MATRICULA!AC34=0,\"\",MATRICULA!AC34)","v":1185}]
[{"$f":"IF(MATRICULA!B19=0,\"\",MATRICULA!B19)","v":"Secundaria Técnica"},null,null,4560,null,null,null,90.243419750643184,null,null,null,466,null,null,null,9.2222442113595893,null,null,null,27,null,null,null,0.53433603799722929,null,null,null,5053,null,null,{"$f":"IF(MATRICULA!AC35=0,\"\",MATRICULA!AC35)","v":5053}]
[{"$f":"IF(MATRICULA!B20=0,\"\",MATRICULA!B20)","v":"Telesecundaria"},null,null,1624,null,null,null,93.11926605504587,null,null,null,106,null,null,null,6.0779816513761471,null,null,null,14,null,null,null,0.80275229357798172,null,null,null,1744,null,null,{"$f":"IF(MATRICULA!AC36=0,\"\",MATRICULA!AC36)","v":1744}]
[{"$f":"IF(MATRICULA!B21=0,\"\",MATRICULA!B21)","v":""},null,null,null,null,null,null,"",null,null,null,null,null,null,null,"",null,null,null,null,null,null,null,"",null,null,null,"",null,null,{"$f":"IF(MATRICULA!AC37=0,\"\",MATRICULA!AC37)","v":""}]
[{"$f":"IF(MATRICULA!B22=0,\"\",MATRICULA!B22)","v":""},null,null,null,null,null,null,"",null,null,null,null,null,null,null,"",null,null,null,null,null,null,null,"",null,null,null,"",null,null,{"$f":"IF(MATRICULA!AC38=0,\"\",MATRICULA!AC38)","v":""}]
[{"$f":"IF(MATRICULA!B23=0,\"\",MATRICULA!B23)","v":""},null,null,null,null,null,null,"",null,null,null,null,null,null,null,"",null,null,null,null,null,null,null,"",null,null,null,"",null,null,{"$f":"IF(MATRICULA!AC39=0,\"\",MATRICULA!AC39)","v":""}]
[{"$f":"IF(MATRICULA!B24=0,\"\",MATRICULA!B24)","v":""},null,null,null,null,null,null,"",null,null,null,null,null,null,null,"",null,null,null,null,null,null,null,"",null,null,null,"",null,null,{"$f":"IF(MATRICULA!AC40=0,\"\",MATRICULA!AC40)","v":""}]
[{"$f":"IF(MATRICULA!B25=0,\"\",MATRICULA!B25)","v":""},null,null,null,null,null,null,"",null,null,null,null,null,null,null,"",null,null,null,null,null,null,null,"",null,null,null,"",null,null,{"$f":"IF(MATRICULA!AC41=0,\"\",MATRICULA!AC41)","v":""}]
[{"$f":"IF(MATRICULA!B26=0,\"\",MATRICULA!B26)","v":""},null,null,null,null,null,null,"",null,null,null,null,null,null,null,"",null,null,null,null,null,null,null,"",null,null,null,"",null,null,{"$f":"IF(MATRICULA!AC42=0,\"\",MATRICULA!AC42)","v":""}]
["TOTAL",null,null,{"$f":"SUM(D17:D26)","v":12524},null,null,null,93.281692238939371,null,null,null,{"$f":"SUM(L17:L26)","v":816},null,null,null,6.0777595709816774,null,null,null,{"$f":"SUM(T17:T26)","v":86},null,null,null,0.64054819007895125,null,null,null,{"$f":"SUM(AB17:AD26)","v":13426},null,null,{"$f":"SUM(AE17:AG26)","v":13426}]

{"sheet":"Gráfica APROV 1","index":4,"n_rows":18,"n_cols":14,"rows_kept":18,"cut":false,"hidden":false,"merged":[[33,0,47,32],[10,26,10,30],[10,0,10,2],[10,7,10,25],[6,1,6,12],[5,13,5,25],[6,13,6,25],[9,0,9,5],[9,7,9,25],[0,0,0,32],[2,1,2,29],[3,1,3,29],[4,1,4,29],[5,1,5,12]]}
[]
[]
[null,"Secretaría de Educación Pública del Estado de Baja California Sur"]
[null,"Dirección de Educación Secundaria"]
[null,"PRIMER GRADO "]
[null,"PERIODO EVALUACIÓN:",null,null,null,null,null,null,null,null,null,null,null,{"$f":"IF('APROV 1'!N7:Z7<>0,'APROV 1'!N7:Z7, \"\")","v":"CONCENTRADO FINAL"}]
[null,"CICLO ESCOLAR :",null,null,null,null,null,null,null,null,null,null,null,{"$f":"IF('APROV 1'!N8:Z8<>0, 'APROV 1'!N8:Z8, \"\")","v":"2021-2022"}]
[]
[]
["DIRECCIÓN: ",null,null,null,null,null,null,"EDUCACIÓN SECUNDARIA"]
["DIRECTORA:",null,null,null,null,null,null,"MTRA. OFELIA ELIZABETH OCHOA ROMERO"]
[]
[]
[]
[]
[]
[null,"Lengua Materna","Matemáticas","Inglés","Ciencias y tecnología (Biología)","Historia","Geografía","Formación Cívica y Ética","Tecnología I","Educación Física","Artes"]
[null,{"$f":"'APROV 1'!B26:D26","v":8.5},{"$f":"'APROV 1'!E26","v":8.4},{"$f":"'APROV 1'!H26","v":8.6},{"$f":"'APROV 1'!K26","v":8.6999999999999993},{"$f":"'APROV 1'!N26","v":8.6},{"$f":"'APROV 1'!Q26","v":8.6},{"$f":"'APROV 1'!T26","v":8.8000000000000007},{"$f":"'APROV 1'!W26","v":9},{"$f":"'APROV 1'!Z26","v":9.4},{"$f":"'APROV 1'!AC26","v":9.1}]

{"sheet":"Gráfica PART 1","index":5,"n_rows":14,"n_cols":14,"rows_kept":14,"cut":false,"hidden":false,"merged":[[9,0,9,5],[9,7,9,25],[10,7,10,25],[10,26,10,30],[0,0,0,32],[2,1,2,29],[3,1,3,29],[4,1,4,29],[5,1,5,12],[5,13,5,25],[6,1,6,12],[6,13,6,25],[10,0,10,2]]}
[]
[]
[null,"Secretaría de Educación Pública del Estado de Baja California Sur"]
[null,"Dirección de Educación Secundaria"]
[null,"PRIMER GRADO "]
[null,"PERIODO EVALUACIÓN:",null,null,null,null,null,null,null,null,null,null,null,{"$f":"IF('APROV 1'!N7:Z7<>0,'APROV 1'!N7:Z7, \"\")","v":"CONCENTRADO FINAL"}]
[null,"CICLO ESCOLAR :",null,null,null,null,null,null,null,null,null,null,null,{"$f":"IF('APROV 1'!N8:Z8<>0, 'APROV 1'!N8:Z8, \"\")","v":"2021-2022"}]
[]
[]
["DIRECCIÓN: ",null,null,null,null,null,null,"EDUCACIÓN SECUNDARIA"]
["DIRECTORA:",null,null,null,null,null,null,"MTRA. OFELIA ELIZABETH OCHOA ROMERO"]
[]
[null,null,null,"COMUNICACIÓN Y PARTICIPACIÓN SOSTENIDA","COMUNICACIÓN Y PARTICIPACIÓN INTERMITENTE","COMUNICACIÓN PRACTICAMENTE INEXISTENTE"]
[null,null,null,{"$f":"'PARTICIPACIÓN 1'!H27/100","v":0.93281692238939373},{"$f":"'PARTICIPACIÓN 1'!P27/100","v":6.0777595709816772E-2},{"$f":"'PARTICIPACIÓN 1'!X27/100","v":6.4054819007895126E-3}]

{"sheet":"APROV 2","index":6,"n_rows":42,"n_cols":30,"rows_kept":42,"cut":false,"hidden":false,"merged":[[18,22,18,24],[18,25,18,27],[18,28,18,29],[19,16,19,18],[19,19,19,21],[19,22,19,24],[19,25,19,27],[17,7,17,9],[17,10,17,12],[17,13,17,15],[17,16,17,18],[17,19,17,21],[17,22,17,24],[17,25,17,27],[43,0,54,29],[15,7,15,9],[14,19,14,21],[15,13,15,15],[15,16,15,18],[15,19,15,21],[14,28,14,29],[14,0,15,0],[14,1,14,3],[14,4,14,6],[14,7,14,9],[14,25,14,27],[15,25,15,27],[22,25,22,27],[23,25,23,27],[24,25,24,27],[16,1,16,3],[16,7,16,9],[16,28,16,29],[17,1,17,3],[17,4,17,6],[17,28,17,29],[18,7,18,9],[18,10,18,12],[20,28,20,29],[21,28,21,29],[13,22,13,27],[16,10,16,12],[16,13,16,15],[16,16,16,18],[16,19,16,21],[16,22,16,24],[16,25,16,27],[20,10,20,12],[20,13,20,15],[20,16,20,18],[20,19,20,21],[20,22,20,24],[20,25,20,27],[21,10,21,12],[21,13,21,15],[21,16,21,18],[21,19,21,21],[21,22,21,24],[13,28,13,29],[18,13,18,15],[18,16,18,18],[18,19,18,21],[22,28,22,29],[23,28,23,29],[24,28,24,29],[22,16,22,18],[23,16,23,18],[24,16,24,18],[22,19,22,21],[23,19,23,21],[24,19,24,21],[24,22,24,24],[22,22,22,24],[23,22,23,24],[41,0,42,29],[25,13,25,15],[25,25,25,27],[25,16,25,18],[25,1,25,3],[28,28,28,29],[25,28,25,29],[25,4,25,6],[25,7,25,9],[28,0,29,0],[28,1,28,3],[28,4,28,6],[28,7,28,9],[28,16,28,18],[28,22,28,24],[28,10,28,12],[25,22,25,24],[25,10,25,12],[27,22,27,27],[27,28,27,29],[19,1,19,3],[19,4,19,6],[19,7,19,9],[19,10,19,12],[19,13,19,15],[2,1,2,26],[3,1,3,26],[4,1,4,26],[5,1,5,26],[10,0,10,2],[6,13,6,23],[7,13,7,23],[6,1,6,12],[7,1,7,12],[9,0,9,5],[9,7,9,25],[10,7,10,25],[10,26,10,30],[15,28,15,29],[14,16,14,18],[15,10,15,12],[14,10,14,12],[14,13,14,15],[19,28,19,29],[28,25,28,27],[20,1,20,3],[20,4,20,6],[20,7,20,9],[21,7,21,9],[25,19,25,21],[21,4,21,6],[22,1,22,3],[23,1,23,3],[22,10,22,12],[23,10,23,12],[24,10,24,12],[21,25,21,27],[13,0,13,21],[28,19,28,21],[27,0,27,21],[14,22,14,24],[15,22,15,24],[11,4,11,10],[11,12,11,13],[22,7,22,9],[23,7,23,9],[24,7,24,9],[22,13,22,15],[23,13,23,15],[24,13,24,15],[15,4,15,6],[22,4,22,6],[23,4,23,6],[24,4,24,6],[15,1,15,3],[16,4,16,6],[18,1,18,3],[18,4,18,6],[21,1,21,3],[24,1,24,3],[28,13,28,15]]}
[]
[]
[null,"Secretaría de Educación Pública del Estado de Baja California Sur"]
[null,"Dirección de Educación Secundaria"]
[null,"APROVECHAMIENTO Y RIESGO DE NO ACREDITAR"]
[null,"SEGUNDO GRADO"]
[null,"PERIODO EVALUACIÓN:",null,null,null,null,null,null,null,null,null,null,null,{"$f":"IF('APROV 1'!N7:Z7<>0,'APROV 1'!N7:Z7, \"\")","v":"CONCENTRADO FINAL"}]
[null,"CICLO ESCOLAR :",null,null,null,null,null,null,null,null,null,null,null,{"$f":"IF('APROV 1'!N8:Z8<>0, 'APROV 1'!N8:Z8, \"\")","v":"2021-2022"}]
[]
["DIRECCIÓN: ",null,null,null,null,null,null,"EDUCACIÓN SECUNDARIA"]
["DIRECTORA:",null,null,null,null,null,null,"MTRA. OFELIA ELIZABETH OCHOA ROMERO"]
[]
[]
["Promedio de Aprovechamiento de los Campos de Formación Académica",null,null,null,null,null,null,null,null,null,null,null,null,null,null,null,null,null,null,null,null,null,"Promedio de Aprovechamiento de las Áreas de Desarrollo Personal y Social"]
["Modalidad","Lengua Materna",null,null,"Matemáticas",null,null,"Inglés",null,null,"Ciencias y tecnología (Física)",null,null,"Historia ",null,null,"Formación Cívica y Ética",null,null,"Tecnología II",null,null,"Educación Física",null,null,"Artes",null,null,"Prom. Final"]
[null,"CALIF",null,null,"CALIF",null,null,"CALIF",null,null,"CALIF",null,null,"CALIF",null,null,"CALIF",null,null,"CALIF",null,null,"CALIF",null,null,"CALIF",null,null,"CALIF"]
[{"$f":"IF(MATRICULA!B17=0,\"\",MATRICULA!B17)","v":"Generales Públicas"},8.6999999999999993,null,null,8.5,null,null,8.6999999999999993,null,null,8.6999999999999993,null,null,8.8000000000000007,null,null,8.9,null,null,9,null,null,9.3000000000000007,null,null,9.1,null,null,{"$f":"IFERROR(ROUND(AVERAGE(B17:AB17),1),\"\")","v":8.9}]
[{"$f":"IF(MATRICULA!B18=0,\"\",MATRICULA!B18)","v":"Particulares"},8.8000000000000007,null,null,8.6,null,null,8.8000000000000007,null,null,8.8000000000000007,null,null,8.8000000000000007,null,null,9,null,null,9.1,null,null,9.6,null,null,9.3000000000000007,null,null,9]
[{"$f":"IF(MATRICULA!B19=0,\"\",MATRICULA!B19)","v":"Secundaria Técnica"},8.6,null,null,8.5,null,null,8.6999999999999993,null,null,8.6,null,null,8.6999999999999993,null,null,8.6,null,null,8.6999999999999993,null,null,9.3000000000000007,null,null,8.9,null,null,{"$f":"IFERROR(ROUND(AVERAGE(B19:AB19),1),\"\")","v":8.6999999999999993}]
[{"$f":"IF(MATRICULA!B20=0,\"\",MATRICULA!B20)","v":"Telesecundaria"},8.4,null,null,8.1999999999999993,null,null,8.3000000000000007,null,null,8.4,null,null,8.4,null,null,8.6999999999999993,null,null,9,null,null,9.1,null,null,9,null,null,8.6]
[{"$f":"IF(MATRICULA!B22=0,\"\",MATRICULA!B22)","v":""},null,null,null,null,null,null,null,null,null,null,null,null,null,null,null,null,null,null,null,null,null,null,null,null,null,null,null,""]
[{"$f":"IF(MATRICULA!B23=0,\"\",MATRICULA!B23)","v":""},null,null,null,null,null,null,null,null,null,null,null,null,null,null,null,null,null,null,null,null,null,null,null,null,null,null,null,""]
[{"$f":"IF(MATRICULA!B24=0,\"\",MATRICULA!B24)","v":""},null,null,null,null,null,null,null,null,null,null,null,null,null,null,null,null,null,null,null,null,null,null,null,null,null,null,null,{"$f":"IFERROR(ROUND(AVERAGE(B23:AB23),1),\"\")","v":""}]
[{"$f":"IF(MATRICULA!B25=0,\"\",MATRICULA!B25)","v":""},null,null,null,null,null,null,null,null,null,null,null,null,null,null,null,null,null,null,null,null,null,null,null,null,null,null,null,""]
[{"$f":"IF(MATRICULA!B26=0,\"\",MATRICULA!B26)","v":""},null,null,null,null,null,null,null,null,null,null,null,null,null,null,null,null,null,null,null,null,null,null,null,null,null,null,null,""]
["Gral.",{"$f":"IFERROR(ROUND(AVERAGE(B17:D25),1),\"\")","v":8.6},null,null,{"$f":"IFERROR(ROUND(AVERAGE(E17:G25),1),\"\")","v":8.5},null,null,{"$f":"IFERROR(ROUND(AVERAGE(H17:J25),1),\"\")","v":8.6},null,null,{"$f":"IFERROR(ROUND(AVERAGE(K17:M25),1),\"\")","v":8.6},null,null,{"$f":"IFERROR(ROUND(AVERAGE(N17:P25),1),\"\")","v":8.6999999999999993},null,null,{"$f":"IFERROR(ROUND(AVERAGE(Q17:S25),1),\"\")","v":8.8000000000000007},null,null,{"$f":"IFERROR(ROUND(AVERAGE(T17:V25),1),\"\")","v":9},null,null,{"$f":"IFERROR(ROUND(AVERAGE(W17:Y25),1),\"\")","v":9.3000000000000007},null,null,{"$f":"IFERROR(ROUND(AVERAGE(Z17:AB25),1),\"\")","v":9.1},null,null,{"$f":"IFERROR(ROUND(AVERAGE(AC17:AD25),1),\"\")","v":8.8000000000000007}]
[]
["Campos de Formación Académica en situacion de riesgo de no acreditar",null,null,null,null,null,null,null,null,null,null,null,null,null,null,null,null,null,null,null,null,null,"Áreas de Desarrollo Personal y Social en situación de riesgo de no acreditar"]
["Modalidad","Lengua Materna",null,null,"Matemáticas",null,null,"Inglés",null,null,"Ciencias y tecnología (Física)",null,null,"Historia ",null,null,"Formación Cívica y Ética",null,null,"Tecnología II",null,null,"Educación Física",null,null,"Artes",null,null,"Total"]
[null,5,6,"T",5,6,"T",5,6,"T",5,6,"T",5,6,"T",5,6,"T",5,6,"T",5,6,"T",5,6,"T",5,6]
[{"$f":"IF(MATRICULA!B17=0,\"\",MATRICULA!B17)","v":"Generales Públicas"},null,570,{"$f":"IF(SUM(B31,C31)=0,\"\",SUM(B31,C31))","v":570},null,628,{"$f":"IF(SUM(E31,F31)=0,\"\",SUM(E31,F31))","v":628},null,650,{"$f":"IF(SUM(H31,I31)=0,\"\",SUM(H31,I31))","v":650},null,584,{"$f":"IF(SUM(K31,L31)=0,\"\",SUM(K31,L31))","v":584},null,492,{"$f":"IF(SUM(N31,O31)=0,\"\",SUM(N31,O31))","v":492},null,391,{"$f":"IF(SUM(Q31,R31)=0,\"\",SUM(Q31,R31))","v":391},null,433,{"$f":"IF(SUM(T31,U31)=0,\"\",SUM(T31,U31))","v":433},null,171,{"$f":"IF(SUM(W31,X31)=0,\"\",SUM(W31,X31))","v":171},null,411,{"$f":"IF(SUM(Z31,AA31)=0,\"\",SUM(Z31,AA31))","v":411},{"$f":"IF(SUM(B31,E31,H31,K31,N31,Q31,T31,W31,Z31)=0,\"\",SUM(B31,E31,H31,K31,N31,Q31,T31,W31,Z31))","v":""},{"$f":"IF(SUM(C31,F31,I31,L31,O31,R31,U31,X31,AA31)=0,\"\",SUM(C31,F31,I31,L31,O31,R31,U31,X31,AA31))","v":4330}]
[{"$f":"IF(MATRICULA!B18=0,\"\",MATRICULA!B18)","v":"Particulares"},null,33,33,null,83,83,null,45,45,null,52,52,null,31,31,null,16,16,null,43,43,null,11,11,null,32,32,"",346]
[{"$f":"IF(MATRICULA!B19=0,\"\",MATRICULA!B19)","v":"Secundaria Técnica"},null,433,433,null,505,505,null,410,410,null,425,425,null,375,375,null,512,512,null,320,320,null,94,94,null,179,179,"",3253]
[{"$f":"IF(MATRICULA!B20=0,\"\",MATRICULA!B20)","v":"Telesecundaria"},null,256,256,null,307,307,null,289,289,null,265,265,null,273,273,null,233,233,null,189,189,null,201,201,null,216,216,"",2229]
[{"$f":"IF(MATRICULA!B22=0,\"\",MATRICULA!B22)","v":""},null,null,"",null,null,"",null,null,"",null,null,"",null,null,"",null,null,"",null,null,"",null,null,"",null,null,"","",""]
[{"$f":"IF(MATRICULA!B23=0,\"\",MATRICULA!B23)","v":""},null,null,"",null,null,"",null,null,"",null,null,"",null,null,"",null,null,"",null,null,"",null,null,"",null,null,"","",""]
[{"$f":"IF(MATRICULA!B24=0,\"\",MATRICULA!B24)","v":""},null,null,{"$f":"IF(SUM(B37,C37)=0,\"\",SUM(B37,C37))","v":""},null,null,{"$f":"IF(SUM(E37,F37)=0,\"\",SUM(E37,F37))","v":""},null,null,{"$f":"IF(SUM(H37,I37)=0,\"\",SUM(H37,I37))","v":""},null,null,{"$f":"IF(SUM(K37,L37)=0,\"\",SUM(K37,L37))","v":""},null,null,{"$f":"IF(SUM(N37,O37)=0,\"\",SUM(N37,O37))","v":""},null,null,{"$f":"IF(SUM(Q37,R37)=0,\"\",SUM(Q37,R37))","v":""},null,null,{"$f":"IF(SUM(T37,U37)=0,\"\",SUM(T37,U37))","v":""},null,null,{"$f":"IF(SUM(W37,X37)=0,\"\",SUM(W37,X37))","v":""},null,null,{"$f":"IF(SUM(Z37,AA37)=0,\"\",SUM(Z37,AA37))","v":""},{"$f":"IF(SUM(B37,E37,H37,K37,N37,Q37,T37,W37,Z37)=0,\"\",SUM(B37,E37,H37,K37,N37,Q37,T37,W37,Z37))","v":""},""]
[{"$f":"IF(MATRICULA!B25=0,\"\",MATRICULA!B25)","v":""},null,null,"",null,null,"",null,null,"",null,null,"",null,null,"",null,null,"",null,null,"",null,null,"",null,null,"","",""]
[{"$f":"IF(MATRICULA!B26=0,\"\",MATRICULA!B26)","v":""},null,null,"",null,null,"",null,null,"",null,null,"",null,null,"",null,null,"",null,null,"",null,null,"",null,null,"","",""]
["Total",{"$f":"IF(SUM(B31:B39)=0,\"\",SUM(B31:B39))","v":""},1292,1292,"",1523,1523,"",1394,1394,"",1326,1326,"",1171,1171,"",1152,1152,"",985,985,"",477,477,"",838,838,"",10158]
[]
["Nota: Para las columnas \"Campos de Formación Académica y Áreas de Desarrollo Personal y Social en riesgo de no acreditar\" registre la cantidad de cincos o seis que existen en cada campo o área."]

{"sheet":"R6 (2)","index":7,"n_rows":23,"n_cols":8,"rows_kept":23,"cut":false,"hidden":false,"merged":[[6,1,6,6],[0,0,0,7],[2,1,2,6],[3,1,3,6],[4,1,4,6],[5,1,5,6],[15,0,15,7],[11,0,11,1],[11,2,11,7],[12,0,12,1],[12,2,13,7],[13,0,13,1],[14,0,14,1]]}
[]
[]
[null,"Secretaría de Educación Pública del Estado de Baja California Sur"]
[null,"Dirección de Educación Secundaria"]
[]
[null,"REGISTRO DE ALUMNOS CON CALIFICACIÓN \"6\" EN UNA O MÁS ASIGNATURAS"]
[null,"SEGUNDO GRADO"]
[]
[null,null,"PERIODO DE EVALUACIÓN:",null,{"$f":"MATRICULA!O6","v":"CONCENTRADO FINAL"}]
[null,null,"CICLO ESCOLAR:",null,{"$f":"IF([1]MATRICULA!O7=0,\"\",[1]MATRICULA!O7)","v":"2021-2022"}]
[]
["DIRECCIÓN:",null,{"$f":"MATRICULA!I10","v":"EDUCACIÓN SECUNDARIA"}]
[null,null,{"$f":"MATRICULA!I11","v":"MTRA. OFELIA ELIZABETH OCHOA ROMERO"}]
["DIRECTORA:"]
[]
["REGISTRAR LA CANTIDAD DE ALUMNOS CON CALIFICACIÓN \"6\" EN UNA O MÁS ASIGNATURAS SEGÚN CORRESPONDA"]
["Modalidad","1 ASIGNATURA","2  ASIGNATURAS","3  ASIGNATURAS","4  ASIGNATURAS","5  ASIGNATURAS","6 O MÁS  ASIGNATURAS","TOTAL"]
["Generales Públicas",461,226,126,100,69,150,1132]
["Particulares",73,43,16,13,8,11,164]
["Secundaria Técnica",358,217,110,77,45,177,984]
["Telesecundaria",76,47,37,29,15,95,299]
[{"$f":"IF([1]MATRICULA!B26=0,\"\",[1]MATRICULA!B26)","v":""},null,null,null,null,null,null,{"$f":"IF(SUM(B22:G22)=0,\"\",SUM(B22:G22))","v":""}]
["TOTAL",{"$f":"IF(SUM(B18:B22)=0,\"\",SUM(B18:B22))","v":968},533,289,219,137,433,2579]

{"sheet":"PARTICIPACIÓN 2","index":8,"n_rows":27,"n_cols":31,"rows_kept":27,"cut":false,"hidden":false,"merged":[[0,0,0,32],[2,1,2,30],[3,1,3,30],[4,1,4,30],[5,1,5,30],[6,13,6,25],[7,13,7,25],[6,1,6,10],[7,1,7,10],[16,0,16,2],[16,7,16,10],[16,15,16,18],[16,23,16,26],[16,30,16,32],[17,0,17,2],[17,7,17,10],[17,15,17,18],[17,23,17,26],[17,30,17,32],[16,27,16,29],[17,27,17,29],[16,19,16,22],[17,19,17,22],[16,3,16,6],[17,3,17,6],[16,11,16,14],[17,11,17,14],[18,30,18,32],[19,0,19,2],[19,7,19,10],[19,15,19,18],[19,23,19,26],[19,30,19,32],[18,0,18,2],[18,7,18,10],[18,15,18,18],[18,27,18,29],[19,27,19,29],[18,19,18,22],[19,19,19,22],[18,3,18,6],[19,3,19,6],[18,11,18,14],[19,11,19,14],[20,30,20,32],[21,0,21,2],[21,7,21,10],[21,15,21,18],[21,23,21,26],[21,30,21,32],[20,0,20,2],[20,7,20,10],[20,15,20,18],[20,27,20,29],[21,27,21,29],[20,19,20,22],[21,19,21,22],[20,3,20,6],[21,3,21,6],[20,11,20,14],[21,11,21,14],[23,30,23,32],[22,0,22,2],[22,7,22,10],[22,15,22,18],[22,27,22,29],[23,27,23,29],[24,27,24,29],[22,19,22,22],[22,11,22,14],[23,11,23,14],[24,11,24,14],[22,3,22,6],[23,3,23,6],[24,3,24,6],[25,27,25,29],[26,27,26,29],[14,27,15,29],[26,23,26,26],[26,30,26,32],[26,0,26,2],[26,7,26,10],[26,15,26,18],[24,23,24,26],[24,30,24,32],[25,0,25,2],[25,7,25,10],[25,15,25,18],[25,23,25,26],[25,30,25,32],[24,0,24,2],[14,3,15,6],[24,7,24,10],[24,15,24,18],[22,23,22,26],[22,30,22,32],[23,0,23,2],[23,7,23,10],[23,15,23,18],[25,3,25,6],[26,3,26,6],[26,11,26,14],[26,19,26,22],[23,19,23,22],[24,19,24,22],[25,19,25,22],[25,11,25,14],[10,7,10,25],[11,7,11,25],[23,23,23,26],[20,23,20,26],[18,23,18,26],[13,0,13,32],[14,0,15,2],[14,7,15,10],[14,15,15,18],[14,23,15,26],[14,30,15,32],[14,11,15,14],[14,19,15,22],[10,0,10,5],[11,0,11,2],[11,26,11,30]]}
[]
[]
[null,"Secretaría de Educación Pública del Estado de Baja California Sur"]
[null,"Dirección de Educación Secundaria"]
[null,"NIVELES DE COMUNICACIÓN Y PARTICIPACIÓN DE ALUMNOS"]
[null,"SEGUNDO GRADO "]
[null,"PERIODO EVALUACIÓN:",null,null,null,null,null,null,null,null,null,null,null,{"$f":"IF('APROV 1'!N7:Z7<>0,'APROV 1'!N7:Z7, \"\")","v":"CONCENTRADO FINAL"}]
[null,"CICLO ESCOLAR :",null,null,null,null,null,null,null,null,null,null,null,{"$f":"IF('APROV 1'!N8:Z8<>0, 'APROV 1'!N8:Z8, \"\")","v":"2021-2022"}]
[]
[]
["DIRECCIÓN: ",null,null,null,null,null,null,"EDUCACIÓN SECUNDARIA"]
["DIRECTORA:",null,null,null,null,null,null,"MTRA. OFELIA ELIZABETH OCHOA ROMERO"]
[]
[" COMUNICACIÓN Y PARTICIPACIÓN CON ALUMNOS  (Registrar cantidad de alumnos)"]
["Modalidad",null,null,"COMUNICACIÓN Y PARTICIPACIÓN SOSTENIDA",null,null,null,"%",null,null,null,"COMUNICACIÓN Y PARTICIPACIÓN INTERMITENTE",null,null,null,"%",null,null,null,"COMUNICACIÓN PRACTICAMENTE INEXISTENTE",null,null,null,"%",null,null,null,"TOTAL",null,null,"MATRÍCULA\nEXISTENCIA"]
[]
[{"$f":"IF(MATRICULA!B17=0,\"\",MATRICULA!B17)","v":"Generales Públicas"},null,null,5336,null,null,null,{"$f":"IFERROR((D17+E17+F17)/AE17*100,\"\")","v":94.79481257772251},null,null,null,246,null,null,null,{"$f":"IFERROR((L17+M17+N17)/AE17*100,\"\")","v":4.3702256173387815},null,null,null,47,null,null,null,{"$f":"IFERROR((T17+U17+V17)/AE17*100,\"\")","v":0.83496180493871019},null,null,null,{"$f":"IF(SUM(D17:G17,L17:O17,T17:W17)=0,\"\",SUM(D17:G17,L17:O17,T17:W17))","v":5629},null,null,{"$f":"IF(MATRICULA!AF33=0,\"\",MATRICULA!AF33)","v":5629}]
[{"$f":"IF(MATRICULA!B18=0,\"\",MATRICULA!B18)","v":"Particulares"},null,null,1190,null,null,null,{"$f":"IFERROR((D18+E18+F18)/AE18*100,\"\")","v":99.748533109807212},null,null,null,3,null,null,null,{"$f":"IFERROR((L18+M18+N18)/AE18*100,\"\")","v":0.25146689019279128},null,null,null,0,null,null,null,{"$f":"IFERROR((T18+U18+V18)/AE18*100,\"\")","v":0},null,null,null,{"$f":"IF(SUM(D18:G18,L18:O18,T18:W18)=0,\"\",SUM(D18:G18,L18:O18,T18:W18))","v":1193},null,null,{"$f":"IF(MATRICULA!AF34=0,\"\",MATRICULA!AF34)","v":1193}]
[{"$f":"IF(MATRICULA!B19=0,\"\",MATRICULA!B19)","v":"Secundaria Técnica"},null,null,4664,null,null,null,91.272015655577292,null,null,null,407,null,null,null,7.9647749510763211,null,null,null,39,null,null,null,0.76320939334637961,null,null,null,5110,null,null,{"$f":"IF(MATRICULA!AF35=0,\"\",MATRICULA!AF35)","v":5110}]
[{"$f":"IF(MATRICULA!B20=0,\"\",MATRICULA!B20)","v":"Telesecundaria"},null,null,1512,null,null,null,93.796526054590572,null,null,null,81,null,null,null,5.0248138957816382,null,null,null,19,null,null,null,1.1786600496277915,null,null,null,1612,null,null,{"$f":"IF(MATRICULA!AF36=0,\"\",MATRICULA!AF36)","v":1612}]
[{"$f":"IF(MATRICULA!B21=0,\"\",MATRICULA!B21)","v":""},null,null,null,null,null,null,"",null,null,null,null,null,null,null,"",null,null,null,null,null,null,null,"",null,null,null,"",null,null,{"$f":"IF(MATRICULA!AF37=0,\"\",MATRICULA!AF37)","v":""}]
[{"$f":"IF(MATRICULA!B22=0,\"\",MATRICULA!B22)","v":""},null,null,null,null,null,null,"",null,null,null,null,null,null,null,"",null,null,null,null,null,null,null,"",null,null,null,"",null,null,{"$f":"IF(MATRICULA!AF38=0,\"\",MATRICULA!AF38)","v":""}]
[{"$f":"IF(MATRICULA!B23=0,\"\",MATRICULA!B23)","v":""},null,null,null,null,null,null,"",null,null,null,null,null,null,null,"",null,null,null,null,null,null,null,"",null,null,null,"",null,null,{"$f":"IF(MATRICULA!AF39=0,\"\",MATRICULA!AF39)","v":""}]
[{"$f":"IF(MATRICULA!B24=0,\"\",MATRICULA!B24)","v":""},null,null,null,null,null,null,"",null,null,null,null,null,null,null,"",null,null,null,null,null,null,null,"",null,null,null,"",null,null,{"$f":"IF(MATRICULA!AF40=0,\"\",MATRICULA!AF40)","v":""}]
[{"$f":"IF(MATRICULA!B25=0,\"\",MATRICULA!B25)","v":""},null,null,null,null,null,null,"",null,null,null,null,null,null,null,"",null,null,null,null,null,null,null,"",null,null,null,"",null,null,{"$f":"IF(MATRICULA!AF41=0,\"\",MATRICULA!AF41)","v":""}]
[{"$f":"IF(MATRICULA!B26=0,\"\",MATRICULA!B26)","v":""},null,null,null,null,null,null,"",null,null,null,null,null,null,null,"",null,null,null,null,null,null,null,"",null,null,null,"",null,null,{"$f":"IF(MATRICULA!AF42=0,\"\",MATRICULA!AF42)","v":""}]
["TOTAL",null,null,{"$f":"SUM(D17:D26)","v":12702},null,null,null,93.783225044300053,null,null,null,{"$f":"SUM(L17:L26)","v":737},null,null,null,5.4415239220318963,null,null,null,{"$f":"SUM(T17:T26)","v":105},null,null,null,0.77525103366804493,null,null,null,{"$f":"SUM(AB17:AD26)","v":13544},null,null,{"$f":"SUM(AE17:AG26)","v":13544}]

{"sheet":"Gráfica APROV 2","index":9,"n_rows":14,"n_cols":10,"rows_kept":14,"cut":false,"hidden":false,"merged":[[9,0,9,2],[9,7,9,25],[9,26,9,30],[10,26,10,30],[10,0,10,2],[10,3,10,11],[10,12,10,13],[10,15,10,22],[10,23,10,24],[8,0,8,5],[8,7,8,25],[6,1,6,12],[6,13,6,25],[0,0,0,32],[2,1,2,29],[3,1,3,29],[4,1,4,29],[5,1,5,12],[5,13,5,25]]}
[]
[]
[null,"Secretaría de Educación Pública del Estado de Baja California Sur"]
[null,"Dirección de Educación Secundaria"]
[null,"SEGUNDO GRADO"]
[]
[]
[]
["DIRECCIÓN: ",null,null,null,null,null,null,"EDUCACIÓN SECUNDARIA"]
["DIRECTORA:",null,null,null,null,null,null,"MTRA. OFELIA ELIZABETH OCHOA ROMERO"]
[]
[]
[null,"Lengua Materna","Matemáticas","Inglés","Ciencias y tecnología (Física)","Historia ","Formación Cívica y Ética ","Tecnología II","Educación Física","Artes"]
[null,{"$f":"'APROV 2'!B26:D26","v":8.6},{"$f":"'APROV 2'!E26","v":8.5},{"$f":"'APROV 2'!H26","v":8.6},{"$f":"'APROV 2'!K26","v":8.6},{"$f":"'APROV 2'!N26","v":8.6999999999999993},{"$f":"'APROV 2'!Q26","v":8.8000000000000007},{"$f":"'APROV 2'!T26","v":9},{"$f":"'APROV 2'!W26","v":9.3000000000000007},{"$f":"'APROV 2'!Z26","v":9.1}]

{"sheet":"Gráfica PART 2","index":10,"n_rows":14,"n_cols":14,"rows_kept":14,"cut":false,"hidden":false,"merged":[[10,26,10,30],[6,1,6,12],[6,13,6,25],[10,0,10,2],[9,0,9,5],[9,7,9,25],[10,7,10,25],[0,0,0,32],[2,1,2,29],[3,1,3,29],[4,1,4,29],[5,1,5,12],[5,13,5,25]]}
[]
[]
[null,"Secretaría de Educación Pública del Estado de Baja California Sur"]
[null,"Dirección de Educación Secundaria"]
[null,"SEGUNDO GRADO "]
[null,"PERIODO EVALUACIÓN:",null,null,null,null,null,null,null,null,null,null,null,{"$f":"IF('APROV 1'!N7:Z7<>0,'APROV 1'!N7:Z7, \"\")","v":"CONCENTRADO FINAL"}]
[null,"CICLO ESCOLAR :",null,null,null,null,null,null,null,null,null,null,null,{"$f":"IF('APROV 1'!N8:Z8<>0, 'APROV 1'!N8:Z8, \"\")","v":"2021-2022"}]
[]
[]
["DIRECCIÓN: ",null,null,null,null,null,null,"EDUCACIÓN SECUNDARIA"]
["DIRECTORA:",null,null,null,null,null,null,"MTRA. OFELIA ELIZABETH OCHOA ROMERO"]
[]
[null,null,null,"COMUNICACIÓN Y PARTICIPACIÓN SOSTENIDA","COMUNICACIÓN Y PARTICIPACIÓN INTERMITENTE","COMUNICACIÓN PRACTICAMENTE INEXISTENTE"]
[null,null,null,{"$f":"'PARTICIPACIÓN 2'!H27/100","v":0.93783225044300056},{"$f":"'PARTICIPACIÓN 2'!P27/100","v":5.4415239220318962E-2},{"$f":"'PARTICIPACIÓN 2'!X27/100","v":7.7525103366804489E-3}]

{"sheet":"APROV 3","index":11,"n_rows":42,"n_cols":30,"rows_kept":42,"cut":false,"hidden":false,"merged":[[20,10,20,12],[20,13,20,15],[20,16,20,18],[20,19,20,21],[20,22,20,24],[20,25,20,27],[21,13,21,15],[21,25,21,27],[21,10,21,12],[18,13,18,15],[18,16,18,18],[18,19,18,21],[18,22,18,24],[18,25,18,27],[17,7,17,9],[17,10,17,12],[17,13,17,15],[17,16,17,18],[17,19,17,21],[17,22,17,24],[20,1,20,3],[2,1,2,26],[3,1,3,26],[5,1,5,26],[6,1,6,12],[7,1,7,12],[6,13,6,23],[4,1,4,26],[7,13,7,23],[9,0,9,5],[9,7,9,25],[10,0,10,2],[11,4,11,10],[11,12,11,13],[16,22,16,24],[15,7,15,9],[15,10,15,12],[15,13,15,15],[15,16,15,18],[16,25,16,27],[17,25,17,27],[18,1,18,3],[18,4,18,6],[18,10,18,12],[28,16,28,18],[28,22,28,24],[13,22,13,24],[14,22,14,24],[22,22,22,24],[23,22,23,24],[24,22,24,24],[25,22,25,24],[27,22,27,27],[21,22,21,24],[19,16,19,18],[19,19,19,21],[19,22,19,24],[19,25,19,27],[28,19,28,21],[27,0,27,21],[13,19,13,21],[14,19,14,21],[22,19,22,21],[23,19,23,21],[24,19,24,21],[15,1,15,3],[21,16,21,18],[21,19,21,21],[19,10,19,12],[25,16,25,18],[25,10,25,12],[25,19,25,21],[13,7,13,9],[22,13,22,15],[23,13,23,15],[13,0,14,0],[24,13,24,15],[25,13,25,15],[25,4,25,6],[25,1,25,3],[15,19,15,21],[25,7,25,9],[22,7,22,9],[17,1,17,3],[17,4,17,6],[19,1,19,3],[19,4,19,6],[21,1,21,3],[21,4,21,6],[21,7,21,9],[18,7,18,9],[19,13,19,15],[10,7,10,25],[15,25,15,27],[16,1,16,3],[16,4,16,6],[16,7,16,9],[16,10,16,12],[16,13,16,15],[16,16,16,18],[16,19,16,21],[10,26,10,30],[12,28,12,29],[12,22,12,27],[14,13,14,15],[13,1,13,3],[13,4,13,6],[13,10,13,12],[12,0,12,21],[15,22,15,24],[13,13,13,15],[13,16,13,18],[14,16,14,18],[14,7,14,9],[15,4,15,6],[14,1,14,3],[20,4,20,6],[20,7,20,9],[27,28,27,29],[28,25,28,27],[28,28,28,29],[25,28,25,29],[25,25,25,27],[13,25,13,27],[14,25,14,27],[22,25,22,27],[23,25,23,27],[24,25,24,27],[13,28,13,29],[14,28,14,29],[22,28,22,29],[23,28,23,29],[24,28,24,29],[15,28,15,29],[16,28,16,29],[17,28,17,29],[18,28,18,29],[19,28,19,29],[20,28,20,29],[19,7,19,9],[41,0,42,29],[22,1,22,3],[23,1,23,3],[24,1,24,3],[14,4,14,6],[22,4,22,6],[23,4,23,6],[24,4,24,6],[23,16,23,18],[24,16,24,18],[14,10,14,12],[22,10,22,12],[23,10,23,12],[24,10,24,12],[21,28,21,29],[23,7,23,9],[24,7,24,9],[28,0,29,0],[28,1,28,3],[28,4,28,6],[28,7,28,9],[28,10,28,12],[28,13,28,15],[22,16,22,18]]}
[]
[]
[null,"Secretaría de Educación Pública del Estado de Baja California Sur"]
[null,"Dirección de Educación Secundaria"]
[null,"APROVECHAMIENTO Y RIESGO DE NO ACREDITAR"]
[null,"TERCER GRADO"]
[null,"PERIODO EVALUACIÓN:",null,null,null,null,null,null,null,null,null,null,null,{"$f":"IF('APROV 1'!N7:Z7<>0,'APROV 1'!N7:Z7, \"\")","v":"CONCENTRADO FINAL"}]
[null,"CICLO ESCOLAR :",null,null,null,null,null,null,null,null,null,null,null,{"$f":"IF('APROV 1'!N8:Z8<>0, 'APROV 1'!N8:Z8, \"\")","v":"2021-2022"}]
[]
["DIRECCIÓN: ",null,null,null,null,null,null,"EDUCACIÓN SECUNDARIA"]
["DIRECTORA:",null,null,null,null,null,null,"MTRA. OFELIA ELIZABETH OCHOA ROMERO"]
[]
["Promedio de Aprovechamiento de los Campos de Formación Académica",null,null,null,null,null,null,null,null,null,null,null,null,null,null,null,null,null,null,null,null,null,"Promedio de Aprovechamiento de las Áreas de Desarrollo Personal y Social"]
["Zona escolar","Español III",null,null,"Matemáticas III",null,null,"Segunda Lengua: Inglés III",null,null,"Ciencias III (Énfasis en Química)",null,null,"Historia II",null,null,"Formación Cívica y Ética II",null,null,"Tecnología III",null,null,"Educación Física III",null,null,"Artes III",null,null,"Prom. Final"]
[null,"CALIF",null,null,"CALIF",null,null,"CALIF",null,null,"CALIF",null,null,"CALIF",null,null,"CALIF",null,null,"CALIF",null,null,"CALIF",null,null,"CALIF",null,null,"CALIF"]
[{"$f":"IF(MATRICULA!B17=0,\"\",MATRICULA!B17)","v":"Generales Públicas"},8.6,null,null,8.4,null,null,8.6999999999999993,null,null,8.6999999999999993,null,null,8.8000000000000007,null,null,8.6999999999999993,null,null,8.9,null,null,9.3000000000000007,null,null,9,null,null,{"$f":"IFERROR(ROUND(AVERAGE(B16:AB16),1),\"\")","v":8.8000000000000007}]
[{"$f":"IF(MATRICULA!B18=0,\"\",MATRICULA!B18)","v":"Particulares"},8.8000000000000007,null,null,8.5,null,null,8.6999999999999993,null,null,8.6999999999999993,null,null,8.9,null,null,9,null,null,9.1,null,null,9.6,null,null,9.3000000000000007,null,null,9]
[{"$f":"IF(MATRICULA!B19=0,\"\",MATRICULA!B19)","v":"Secundaria Técnica"},8.6,null,null,8.4,null,null,8.6,null,null,8.5,null,null,8.6,null,null,8.6,null,null,8.8000000000000007,null,null,9.3000000000000007,null,null,8.9,null,null,8.6999999999999993]
[{"$f":"IF(MATRICULA!B20=0,\"\",MATRICULA!B20)","v":"Telesecundaria"},8.3000000000000007,null,null,8.1999999999999993,null,null,8.3000000000000007,null,null,8.3000000000000007,null,null,8.3000000000000007,null,null,8.6,null,null,8.9,null,null,9,null,null,8.9,null,null,8.5]
[{"$f":"IF(MATRICULA!B21=0,\"\",MATRICULA!B21)","v":""},null,null,null,null,null,null,null,null,null,null,null,null,null,null,null,null,null,null,null,null,null,null,null,null,null,null,null,""]
[{"$f":"IF(MATRICULA!B22=0,\"\",MATRICULA!B22)","v":""},null,null,null,null,null,null,null,null,null,null,null,null,null,null,null,null,null,null,null,null,null,null,null,null,null,null,null,""]
[{"$f":"IF(MATRICULA!B23=0,\"\",MATRICULA!B23)","v":""},null,null,null,null,null,null,null,null,null,null,null,null,null,null,null,null,null,null,null,null,null,null,null,null,null,null,null,""]
[{"$f":"IF(MATRICULA!B24=0,\"\",MATRICULA!B24)","v":""},null,null,null,null,null,null,null,null,null,null,null,null,null,null,null,null,null,null,null,null,null,null,null,null,null,null,null,{"$f":"IFERROR(ROUND(AVERAGE(B23:AB23),1),\"\")","v":""}]
[{"$f":"IF(MATRICULA!B25=0,\"\",MATRICULA!B25)","v":""},null,null,null,null,null,null,null,null,null,null,null,null,null,null,null,null,null,null,null,null,null,null,null,null,null,null,null,""]
[{"$f":"IF(MATRICULA!B26=0,\"\",MATRICULA!B26)","v":""},null,null,null,null,null,null,null,null,null,null,null,null,null,null,null,null,null,null,null,null,null,null,null,null,null,null,null,""]
["Gral.",{"$f":"IFERROR(ROUND(AVERAGE(B16:D25),1),\"\")","v":8.6},null,null,{"$f":"IFERROR(ROUND(AVERAGE(E16:G25),1),\"\")","v":8.4},null,null,{"$f":"IFERROR(ROUND(AVERAGE(H16:J25),1),\"\")","v":8.6},null,null,{"$f":"IFERROR(ROUND(AVERAGE(K16:M25),1),\"\")","v":8.6},null,null,{"$f":"IFERROR(ROUND(AVERAGE(N16:P25),1),\"\")","v":8.6999999999999993},null,null,{"$f":"IFERROR(ROUND(AVERAGE(Q16:S25),1),\"\")","v":8.6999999999999993},null,null,{"$f":"IFERROR(ROUND(AVERAGE(T16:V25),1),\"\")","v":8.9},null,null,{"$f":"IFERROR(ROUND(AVERAGE(W16:Y25),1),\"\")","v":9.3000000000000007},null,null,{"$f":"IFERROR(ROUND(AVERAGE(Z16:AB25),1),\"\")","v":9},null,null,{"$f":"IFERROR(ROUND(AVERAGE(AC16:AD25),1),\"\")","v":8.8000000000000007}]
[]
["Campos de Formación Académica en situacion de riesgo de no acreditar",null,null,null,null,null,null,null,null,null,null,null,null,null,null,null,null,null,null,null,null,null,"Áreas de Desarrollo Personal y Social en situación de riesgo de no acreditar"]
["Zona escolar","Español III",null,null,"Matemáticas III",null,null,"Segunda Lengua: Inglés III",null,null,"Ciencias III (Énfasis en Química)",null,null,"Historia II",null,null,"Formación Cívica y Ética II",null,null,"Tecnología III",null,null,"Educación Física III",null,null,"Artes III",null,null,"Total"]
[null,5,6,"T",5,6,"T",5,6,"T",5,6,"T",5,6,"T",5,6,"T",5,6,"T",5,6,"T",5,6,"T",5,6]
[{"$f":"IF(MATRICULA!B17=0,\"\",MATRICULA!B17)","v":"Generales Públicas"},null,594,{"$f":"IF(SUM(B31,C31)=0,\"\",SUM(B31,C31))","v":594},null,735,{"$f":"IF(SUM(E31,F31)=0,\"\",SUM(E31,F31))","v":735},null,475,{"$f":"IF(SUM(H31,I31)=0,\"\",SUM(H31,I31))","v":475},null,582,{"$f":"IF(SUM(K31,L31)=0,\"\",SUM(K31,L31))","v":582},null,459,{"$f":"IF(SUM(N31,O31)=0,\"\",SUM(N31,O31))","v":459},null,445,{"$f":"IF(SUM(Q31,R31)=0,\"\",SUM(Q31,R31))","v":445},null,445,{"$f":"IF(SUM(T31,U31)=0,\"\",SUM(T31,U31))","v":445},null,227,{"$f":"IF(SUM(W31,X31)=0,\"\",SUM(W31,X31))","v":227},null,417,{"$f":"IF(SUM(Z31,AA31)=0,\"\",SUM(Z31,AA31))","v":417},{"$f":"IF(SUM(B31,E31,H31,K31,N31,Q31,T31,W31,Z31)=0,\"\",SUM(B31,E31,H31,K31,N31,Q31,T31,W31,Z31))","v":""},{"$f":"IF(SUM(C31,F31,I31,L31,O31,R31,U31,X31,AA31)=0,\"\",SUM(C31,F31,I31,L31,O31,R31,U31,X31,AA31))","v":4379}]
[{"$f":"IF(MATRICULA!B18=0,\"\",MATRICULA!B18)","v":"Particulares"},null,38,38,null,110,110,null,67,67,null,72,72,null,33,33,null,33,33,null,40,40,null,10,10,null,13,13,"",416]
[{"$f":"IF(MATRICULA!B19=0,\"\",MATRICULA!B19)","v":"Secundaria Técnica"},null,498,498,null,676,676,null,578,578,null,640,640,null,501,501,null,588,588,null,368,368,null,144,144,null,272,272,"",4265]
[{"$f":"IF(MATRICULA!B20=0,\"\",MATRICULA!B20)","v":"Telesecundaria"},null,401,401,null,437,437,null,410,410,null,402,402,null,426,426,null,366,366,null,330,330,null,319,319,null,335,335,"",3426]
[{"$f":"IF(MATRICULA!B21=0,\"\",MATRICULA!B21)","v":""},null,null,"",null,null,"",null,null,"",null,null,"",null,null,"",null,null,"",null,null,"",null,null,"",null,null,"","",""]
[{"$f":"IF(MATRICULA!B22=0,\"\",MATRICULA!B22)","v":""},null,null,"",null,null,"",null,null,"",null,null,"",null,null,"",null,null,"",null,null,"",null,null,"",null,null,"","",""]
[{"$f":"IF(MATRICULA!B23=0,\"\",MATRICULA!B23)","v":""},null,null,"",null,null,"",null,null,"",null,null,"",null,null,"",null,null,"",null,null,"",null,null,"",null,null,"","",""]
[{"$f":"IF(MATRICULA!B24=0,\"\",MATRICULA!B24)","v":""},null,null,{"$f":"IF(SUM(B38,C38)=0,\"\",SUM(B38,C38))","v":""},null,null,{"$f":"IF(SUM(E38,F38)=0,\"\",SUM(E38,F38))","v":""},null,null,{"$f":"IF(SUM(H38,I38)=0,\"\",SUM(H38,I38))","v":""},null,null,{"$f":"IF(SUM(K38,L38)=0,\"\",SUM(K38,L38))","v":""},null,null,{"$f":"IF(SUM(N38,O38)=0,\"\",SUM(N38,O38))","v":""},null,null,{"$f":"IF(SUM(Q38,R38)=0,\"\",SUM(Q38,R38))","v":""},null,null,{"$f":"IF(SUM(T38,U38)=0,\"\",SUM(T38,U38))","v":""},null,null,{"$f":"IF(SUM(W38,X38)=0,\"\",SUM(W38,X38))","v":""},null,null,{"$f":"IF(SUM(Z38,AA38)=0,\"\",SUM(Z38,AA38))","v":""},{"$f":"IF(SUM(B38,E38,H38,K38,N38,Q38,T38,W38,Z38)=0,\"\",SUM(B38,E38,H38,K38,N38,Q38,T38,W38,Z38))","v":""},""]
[{"$f":"IF(MATRICULA!B25=0,\"\",MATRICULA!B25)","v":""},null,null,"",null,null,"",null,null,"",null,null,"",null,null,"",null,null,"",null,null,"",null,null,"",null,null,"","",""]
[{"$f":"IF(MATRICULA!B26=0,\"\",MATRICULA!B26)","v":""},null,null,"",null,null,"",null,null,"",null,null,"",null,null,"",null,null,"",null,null,"",null,null,"",null,null,"","",""]
["Total",{"$f":"IF(SUM(B31:B40)=0,\"\",SUM(B31:B40))","v":""},1531,1531,"",1958,1958,"",1530,1530,"",1696,1696,"",1419,1419,"",1432,1432,"",1183,1183,"",700,700,"",1037,1037,"",12486]
["Nota: Para las columnas \"Campos de Formación Académica y Áreas de Desarrollo Personal y Social en riesgo de no acreditar\" registre la cantidad de cincos o seis que existen en cada campo o área."]

{"sheet":"R6 (3)","index":12,"n_rows":23,"n_cols":8,"rows_kept":23,"cut":false,"hidden":false,"merged":[[6,1,6,6],[0,0,0,7],[2,1,2,6],[3,1,3,6],[4,1,4,6],[5,1,5,6],[15,0,15,7],[11,0,11,1],[11,2,11,7],[12,0,12,1],[12,2,13,7],[13,0,13,1],[14,0,14,1]]}
[]
[]
[null,"Secretaría de Educación Pública del Estado de Baja California Sur"]
[null,"Dirección de Educación Secundaria"]
[]
[null,"REGISTRO DE ALUMNOS CON CALIFICACIÓN \"6\" EN UNA O MÁS ASIGNATURAS"]
[null,"TERCER GRADO"]
[]
[null,null,"PERIODO DE EVALUACIÓN:",null,{"$f":"MATRICULA!O6","v":"CONCENTRADO FINAL"}]
[null,null,"CICLO ESCOLAR:",null,{"$f":"IF([1]MATRICULA!O7=0,\"\",[1]MATRICULA!O7)","v":"2021-2022"}]
[]
["DIRECCIÓN:",null,{"$f":"MATRICULA!I10","v":"EDUCACIÓN SECUNDARIA"}]
[null,null,{"$f":"MATRICULA!I11","v":"MTRA. OFELIA ELIZABETH OCHOA ROMERO"}]
["DIRECTORA:"]
[]
["REGISTRAR LA CANTIDAD DE ALUMNOS CON CALIFICACIÓN \"6\" EN UNA O MÁS ASIGNATURAS SEGÚN CORRESPONDA"]
["Modalidad","1 ASIGNATURA","2  ASIGNATURAS","3  ASIGNATURAS","4  ASIGNATURAS","5  ASIGNATURAS","6 O MÁS  ASIGNATURAS","TOTAL"]
["Generales Públicas",414,219,140,87,69,111,1040]
["Particulares",48,33,12,14,17,3,127]
["Secundaria Técnica",446,231,144,104,53,229,1207]
["Telesecundaria",75,62,34,42,29,203,445]
[{"$f":"IF([1]MATRICULA!B26=0,\"\",[1]MATRICULA!B26)","v":""},null,null,null,null,null,null,{"$f":"IF(SUM(B22:G22)=0,\"\",SUM(B22:G22))","v":""}]
["TOTAL",{"$f":"IF(SUM(B18:B22)=0,\"\",SUM(B18:B22))","v":983},545,330,247,168,546,2819]

{"sheet":"PARTICIPACIÓN 3","index":13,"n_rows":27,"n_cols":31,"rows_kept":27,"cut":false,"hidden":false,"merged":[[26,23,26,26],[26,30,26,32],[26,0,26,2],[26,7,26,10],[26,15,26,18],[24,23,24,26],[24,30,24,32],[25,0,25,2],[25,7,25,10],[25,15,25,18],[25,23,25,26],[25,30,25,32],[24,0,24,2],[24,7,24,10],[24,15,24,18],[24,27,24,29],[25,27,25,29],[26,27,26,29],[22,23,22,26],[22,30,22,32],[23,0,23,2],[23,7,23,10],[23,15,23,18],[23,23,23,26],[23,30,23,32],[22,0,22,2],[22,7,22,10],[22,15,22,18],[22,27,22,29],[23,27,23,29],[22,19,22,22],[23,19,23,22],[22,3,22,6],[23,3,23,6],[20,23,20,26],[20,30,20,32],[21,0,21,2],[21,7,21,10],[21,15,21,18],[21,23,21,26],[21,30,21,32],[20,0,20,2],[20,7,20,10],[20,15,20,18],[20,27,20,29],[21,27,21,29],[20,19,20,22],[21,19,21,22],[20,3,20,6],[21,3,21,6],[18,23,18,26],[18,30,18,32],[19,0,19,2],[19,7,19,10],[19,15,19,18],[19,23,19,26],[19,30,19,32],[18,0,18,2],[18,7,18,10],[18,15,18,18],[18,27,18,29],[19,27,19,29],[18,19,18,22],[19,19,19,22],[18,3,18,6],[19,3,19,6],[14,11,15,14],[14,19,15,22],[16,0,16,2],[16,7,16,10],[16,15,16,18],[16,23,16,26],[16,30,16,32],[14,27,15,29],[17,0,17,2],[17,7,17,10],[17,15,17,18],[17,23,17,26],[17,30,17,32],[16,27,16,29],[17,27,17,29],[16,19,16,22],[17,19,17,22],[16,3,16,6],[17,3,17,6],[10,0,10,5],[10,7,10,25],[11,0,11,2],[11,7,11,25],[11,26,11,30],[0,0,0,32],[2,1,2,30],[3,1,3,30],[4,1,4,30],[5,1,5,30],[6,13,6,25],[7,13,7,25],[6,1,6,11],[7,1,7,11],[13,0,13,32],[14,0,15,2],[24,3,24,6],[25,3,25,6],[26,3,26,6],[26,11,26,14],[26,19,26,22],[24,19,24,22],[25,19,25,22],[16,11,16,14],[17,11,17,14],[18,11,18,14],[19,11,19,14],[20,11,20,14],[21,11,21,14],[22,11,22,14],[23,11,23,14],[24,11,24,14],[25,11,25,14],[14,7,15,10],[14,15,15,18],[14,23,15,26],[14,30,15,32],[14,3,15,6]]}
[]
[]
[null,"Secretaría de Educación Pública del Estado de Baja California Sur"]
[null,"Dirección de Educación Secundaria"]
[null,"NIVELES DE COMUNICACIÓN Y PARTICIPACIÓN DE ALUMNOS"]
[null,"TERCER GRADO "]
[null,"PERIODO EVALUACIÓN:",null,null,null,null,null,null,null,null,null,null,null,{"$f":"IF('APROV 1'!N7:Z7<>0,'APROV 1'!N7:Z7, \"\")","v":"CONCENTRADO FINAL"}]
[null,"CICLO ESCOLAR :",null,null,null,null,null,null,null,null,null,null,null,{"$f":"IF('APROV 1'!N8:Z8<>0, 'APROV 1'!N8:Z8, \"\")","v":"2021-2022"}]
[]
[]
["DIRECCIÓN: ",null,null,null,null,null,null,"EDUCACIÓN SECUNDARIA"]
["DIRECTORA:",null,null,null,null,null,null,"MTRA. OFELIA ELIZABETH OCHOA ROMERO"]
[]
[" COMUNICACIÓN Y PARTICIPACIÓN CON ALUMNOS  (Registrar cantidad de alumnos)"]
["Modalidad",null,null,"COMUNICACIÓN Y PARTICIPACIÓN SOSTENIDA",null,null,null,"%",null,null,null,"COMUNICACIÓN Y PARTICIPACIÓN INTERMITENTE",null,null,null,"%",null,null,null,"COMUNICACIÓN PRACTICAMENTE INEXISTENTE",null,null,null,"%",null,null,null,"TOTAL",null,null,"MATRÍCULA\nEXISTENCIA"]
[]
[{"$f":"IF(MATRICULA!B17=0,\"\",MATRICULA!B17)","v":"Generales Públicas"},null,null,4998,null,null,null,{"$f":"IFERROR((D17+E17+F17)/AE17*100,\"\")","v":94.569536423841058},null,null,null,244,null,null,null,{"$f":"IFERROR((L17+M17+N17)/AE17*100,\"\")","v":4.6168401135288555},null,null,null,43,null,null,null,{"$f":"IFERROR((T17+U17+V17)/AE17*100,\"\")","v":0.81362346263008523},null,null,null,{"$f":"IF(SUM(D17:G17,L17:O17,T17:W17)=0,\"\",SUM(D17:G17,L17:O17,T17:W17))","v":5285},null,null,{"$f":"IF(MATRICULA!AI33=0,\"\",MATRICULA!AI33)","v":5285}]
[{"$f":"IF(MATRICULA!B18=0,\"\",MATRICULA!B18)","v":"Particulares"},null,null,1184,null,null,null,{"$f":"IFERROR((D18+E18+F18)/AE18*100,\"\")","v":99.328859060402692},null,null,null,8,null,null,null,{"$f":"IFERROR((L18+M18+N18)/AE18*100,\"\")","v":0.67114093959731547},null,null,null,0,null,null,null,{"$f":"IFERROR((T18+U18+V18)/AE18*100,\"\")","v":0},null,null,null,{"$f":"IF(SUM(D18:G18,L18:O18,T18:W18)=0,\"\",SUM(D18:G18,L18:O18,T18:W18))","v":1192},null,null,{"$f":"IF(MATRICULA!AI34=0,\"\",MATRICULA!AI34)","v":1192}]
[{"$f":"IF(MATRICULA!B19=0,\"\",MATRICULA!B19)","v":"Secundaria Técnica"},null,null,4477,null,null,null,90.062361697847521,null,null,null,468,null,null,null,9.4146047073023542,null,null,null,26,null,null,null,0.52303359485013079,null,null,null,4971,null,null,{"$f":"IF(MATRICULA!AI35=0,\"\",MATRICULA!AI35)","v":4971}]
[{"$f":"IF(MATRICULA!B20=0,\"\",MATRICULA!B20)","v":"Telesecundaria"},null,null,1518,null,null,null,92.055791388720436,null,null,null,116,null,null,null,7.03456640388114,null,null,null,15,null,null,null,0.90964220739842339,null,null,null,1649,null,null,{"$f":"IF(MATRICULA!AI36=0,\"\",MATRICULA!AI36)","v":1649}]
[{"$f":"IF(MATRICULA!B21=0,\"\",MATRICULA!B21)","v":""},null,null,null,null,null,null,"",null,null,null,null,null,null,null,"",null,null,null,null,null,null,null,"",null,null,null,"",null,null,{"$f":"IF(MATRICULA!AI37=0,\"\",MATRICULA!AI37)","v":""}]
[{"$f":"IF(MATRICULA!B22=0,\"\",MATRICULA!B22)","v":""},null,null,null,null,null,null,"",null,null,null,null,null,null,null,"",null,null,null,null,null,null,null,"",null,null,null,"",null,null,{"$f":"IF(MATRICULA!AI38=0,\"\",MATRICULA!AI38)","v":""}]
[{"$f":"IF(MATRICULA!B23=0,\"\",MATRICULA!B23)","v":""},null,null,null,null,null,null,"",null,null,null,null,null,null,null,"",null,null,null,null,null,null,null,"",null,null,null,"",null,null,{"$f":"IF(MATRICULA!AI39=0,\"\",MATRICULA!AI39)","v":""}]
[{"$f":"IF(MATRICULA!B24=0,\"\",MATRICULA!B24)","v":""},null,null,null,null,null,null,"",null,null,null,null,null,null,null,"",null,null,null,null,null,null,null,"",null,null,null,"",null,null,{"$f":"IF(MATRICULA!AI40=0,\"\",MATRICULA!AI40)","v":""}]
[{"$f":"IF(MATRICULA!B25=0,\"\",MATRICULA!B25)","v":""},null,null,null,null,null,null,"",null,null,null,null,null,null,null,"",null,null,null,null,null,null,null,"",null,null,null,"",null,null,{"$f":"IF(MATRICULA!AI41=0,\"\",MATRICULA!AI41)","v":""}]
[{"$f":"IF(MATRICULA!B26=0,\"\",MATRICULA!B26)","v":""},null,null,null,null,null,null,"",null,null,null,null,null,null,null,"",null,null,null,null,null,null,null,"",null,null,null,"",null,null,{"$f":"IF(MATRICULA!AI42=0,\"\",MATRICULA!AI42)","v":""}]
["TOTAL",null,null,{"$f":"SUM(D17:D26)","v":12177},null,null,null,92.975490570359625,null,null,null,{"$f":"SUM(L17:L26)","v":836},null,null,null,6.3831411773688629,null,null,null,{"$f":"SUM(T17:T26)","v":84},null,null,null,0.64136825227151262,null,null,null,{"$f":"SUM(AB17:AD26)","v":13097},null,null,{"$f":"SUM(AE17:AG26)","v":13097}]

{"sheet":"Gráfica APROV 3","index":14,"n_rows":13,"n_cols":14,"rows_kept":13,"cut":false,"hidden":false,"merged":[[9,26,9,30],[11,0,28,0],[11,10,28,16],[9,0,9,2],[8,0,8,5],[8,7,8,25],[9,7,9,25],[6,13,6,23],[5,13,5,23],[0,0,0,32],[2,1,2,29],[3,1,3,29],[4,1,4,29],[5,1,5,12],[6,1,6,12]]}
[]
[]
[null,"Secretaría de Educación Pública del Estado de Baja California Sur"]
[null,"Dirección de Educación Secundaria"]
[null,"TERCER GRADO"]
[null,"PERIODO EVALUACIÓN:",null,null,null,null,null,null,null,null,null,null,null,{"$f":"IF('APROV 1'!N7:Z7<>0,'APROV 1'!N7:Z7, \"\")","v":"CONCENTRADO FINAL"}]
[null,"CICLO ESCOLAR :",null,null,null,null,null,null,null,null,null,null,null,{"$f":"IF('APROV 1'!N8:Z8<>0, 'APROV 1'!N8:Z8, \"\")","v":"2021-2022"}]
[]
["DIRECCIÓN: ",null,null,null,null,null,null,"EDUCACIÓN SECUNDARIA"]
["DIRECTORA:",null,null,null,null,null,null,"MTRA. OFELIA ELIZABETH OCHOA ROMERO"]
[]
[null,"Español III","Matemáticas III","Segunda Lengua: Inglés III","Ciencias III (Énfasis en Química)","Historia II","Formación Cívica y Ética II","Tecnología III","Educación Física III","Artes III"]
[null,{"$f":"'APROV 3'!B26:D26","v":8.6},{"$f":"'APROV 3'!E26","v":8.4},{"$f":"'APROV 3'!H26","v":8.6},{"$f":"'APROV 3'!K26","v":8.6},{"$f":"'APROV 3'!N26","v":8.6999999999999993},{"$f":"'APROV 3'!Q26","v":8.6999999999999993},{"$f":"'APROV 3'!T26","v":8.9},{"$f":"'APROV 3'!W26","v":9.3000000000000007},{"$f":"'APROV 3'!Z26","v":9}]

{"sheet":"Gráfica PART 3","index":15,"n_rows":14,"n_cols":14,"rows_kept":14,"cut":false,"hidden":false,"merged":[[10,26,10,30],[6,1,6,12],[6,13,6,25],[10,0,10,2],[9,0,9,5],[9,7,9,25],[10,7,10,25],[0,0,0,32],[2,1,2,29],[3,1,3,29],[4,1,4,29],[5,1,5,12],[5,13,5,25]]}
[]
[]
[null,"Secretaría de Educación Pública del Estado de Baja California Sur"]
[null,"Dirección de Educación Secundaria"]
[null,"TERCER GRADO "]
[null,"PERIODO EVALUACIÓN:",null,null,null,null,null,null,null,null,null,null,null,{"$f":"IF('APROV 1'!N7:Z7<>0,'APROV 1'!N7:Z7, \"\")","v":"CONCENTRADO FINAL"}]
[null,"CICLO ESCOLAR :",null,null,null,null,null,null,null,null,null,null,null,{"$f":"IF('APROV 1'!N8:Z8<>0, 'APROV 1'!N8:Z8, \"\")","v":"2021-2022"}]
[]
[]
["DIRECCIÓN: ",null,null,null,null,null,null,"EDUCACIÓN SECUNDARIA"]
["DIRECTORA:",null,null,null,null,null,null,"MTRA. OFELIA ELIZABETH OCHOA ROMERO"]
[]
[null,null,null,"COMUNICACIÓN Y PARTICIPACIÓN SOSTENIDA","COMUNICACIÓN Y PARTICIPACIÓN INTERMITENTE","COMUNICACIÓN PRACTICAMENTE INEXISTENTE"]
[null,null,null,{"$f":"'PARTICIPACIÓN 3'!H27/100","v":0.9297549057035962},{"$f":"'PARTICIPACIÓN 3'!P27/100","v":6.3831411773688632E-2},{"$f":"'PARTICIPACIÓN 3'!X27/100","v":6.4136825227151259E-3}]

{"sheet":"Gráfica Promedios Finales","index":16,"n_rows":15,"n_cols":14,"rows_kept":15,"cut":false,"hidden":false,"merged":[[7,0,7,5],[7,7,7,25],[8,0,8,2],[25,0,105,31],[8,7,8,25],[8,26,8,30],[0,0,0,31],[2,1,2,29],[3,1,3,29],[4,1,4,12],[5,1,5,12],[5,13,5,25],[4,13,4,25]]}
[]
[]
[null,"Secretaría de Educación Pública del Estado de Baja California Sur"]
[null,"Dirección de Educación Secundaria"]
[null,"PERIODO DE EVALUACIÓN:",null,null,null,null,null,null,null,null,null,null,null,{"$f":"IF('APROV 1'!N7:Z7<>0,'APROV 1'!N7:Z7, \"\")","v":"CONCENTRADO FINAL"}]
[null,"CICLO ESCOLAR :",null,null,null,null,null,null,null,null,null,null,null,{"$f":"IF('APROV 1'!N8:Z8<>0, 'APROV 1'!N8:Z8, \"\")","v":"2021-2022"}]
[]
["DIRECCIÓN: ",null,null,null,null,null,null,"EDUCACIÓN SECUNDARIA"]
["DIRECTORA:",null,null,null,null,null,null,"MTRA. OFELIA ELIZABETH OCHOA ROMERO"]
[]
[]
[]
[]
[null,"PROMEDIO 1RO","PROMEDIO 2DO","PROMEDIO 3ERO"]
[null,{"$f":"+'APROV 1'!AF26","v":8.8000000000000007},{"$f":"+'APROV 2'!AC26","v":8.8000000000000007},{"$f":"'APROV 3'!AC26","v":8.8000000000000007}]

{"sheet":"NORMALIDAD MÍNIMA","index":17,"n_rows":60,"n_cols":16,"rows_kept":60,"cut":false,"hidden":false,"merged":[[53,9,53,14],[38,0,38,15],[11,13,11,14],[24,0,24,15],[11,8,11,10],[11,11,11,12],[11,0,12,0],[11,1,11,3],[11,4,11,6],[25,11,25,12],[25,13,25,14],[25,0,26,0],[8,0,8,5],[8,7,8,25],[9,0,9,2],[9,7,9,25],[39,0,40,0],[39,1,39,3],[39,4,39,6],[39,7,40,7],[11,7,12,7],[25,8,25,10],[39,8,39,10],[25,1,37,3],[25,4,25,6],[25,7,26,7],[39,11,39,12],[39,13,39,14],[2,1,2,14],[3,1,3,14],[4,1,4,14],[5,1,5,7],[6,1,6,6],[5,8,5,12],[6,8,6,12],[9,26,9,30],[61,0,77,15],[52,0,52,15],[60,0,60,15],[53,0,53,8],[57,0,57,8],[57,9,57,14],[55,9,55,14],[59,0,59,8],[56,0,56,8],[58,0,58,8],[58,9,58,14],[56,9,56,14],[54,0,54,8],[54,9,54,14],[55,0,55,8]]}
[]
[]
[null,"Secretaría de Educación Pública del Estado de Baja California Sur"]
[null,"Dirección de Educación Secundaria"]
[null,"NORMALIDAD MÍNIMA"]
[null,"PERIODO DE EVALUACIÓN:",null,null,null,null,null,null,{"$f":"IF('APROV 1'!N7<>0,'APROV 1'!N7, \"\")","v":"CONCENTRADO FINAL"}]
[null,"CICLO ESCOLAR :",null,null,null,null,null,null,{"$f":"IF('APROV 1'!N8<>0, 'APROV 1'!N8, \"\")","v":"2021-2022"}]
[]
["DIRECCIÓN: ",null,null,null,null,null,null,"EDUCACIÓN SECUNDARIA"]
["DIRECTORA:",null,null,null,null,null,null,"MTRA. OFELIA ELIZABETH OCHOA ROMERO"]
[]
["Modalidad","DIRECTIVOS\n(Directores, subdirectores)",null,null,"COORDINADORES",null,null,"R","INASISTENCIAS",null,null,"LICENCIAS ECONÓMICAS",null,"LICENCIAS MÉDICAS",null,"TOTAL DE DÍAS NO LABORADOS"]
[null,"H","M","T","H","M","T",null,"I ","P.D.","D.N.L.I y P.D.","L.E."," D.N.L.E.","L.M.","D.N.L.M.","DNLI y PD, DNLE, DNLM"]
[{"$f":"IF(MATRICULA!B17=0,\"\",MATRICULA!B17)","v":"Generales Públicas"},47,32,{"$f":"IF(SUM(B14,C14)=0,\"\",SUM(B14,C14))","v":79},22,14,{"$f":"IF(SUM(E14,F14)=0,\"\",SUM(E14,F14))","v":36},1,70,20,{"$f":"IF(SUM(I14,J14)=0,\"\",SUM(I14,J14))","v":90},52,135,42,436,{"$f":"IF(SUM(K14,M14,O14)=0,\"\",SUM(K14,M14,O14))","v":661}]
[{"$f":"IF(MATRICULA!B18=0,\"\",MATRICULA!B18)","v":"Particulares"},null,null,{"$f":"IF(SUM(B15,C15)=0,\"\",SUM(B15,C15))","v":""},null,null,{"$f":"IF(SUM(E15,F15)=0,\"\",SUM(E15,F15))","v":""},null,null,null,{"$f":"IF(SUM(I15,J15)=0,\"\",SUM(I15,J15))","v":""},null,null,null,null,""]
[{"$f":"IF(MATRICULA!B19=0,\"\",MATRICULA!B19)","v":"Secundaria Técnica"},37,23,60,24,25,49,15,null,12,12,67,172,43,211,395]
[{"$f":"IF(MATRICULA!B20=0,\"\",MATRICULA!B20)","v":"Telesecundaria"},39,12,51,null,null,"",null,null,6,6,44,71,10,59,136]
[{"$f":"IF(MATRICULA!B21=0,\"\",MATRICULA!B21)","v":""},null,null,"",null,null,"",null,null,null,"",null,null,null,null,""]
[{"$f":"IF(MATRICULA!B22=0,\"\",MATRICULA!B22)","v":""},null,null,"",null,null,"",null,null,null,"",null,null,null,null,""]
[{"$f":"IF(MATRICULA!B23=0,\"\",MATRICULA!B23)","v":""},null,null,"",null,null,"",null,null,null,"",null,null,null,null,""]
[{"$f":"IF(MATRICULA!B24=0,\"\",MATRICULA!B24)","v":""},null,null,"",null,null,"",null,null,null,"",null,null,null,null,""]
[{"$f":"IF(MATRICULA!B25=0,\"\",MATRICULA!B25)","v":""},null,null,"",null,null,"",null,null,null,"",null,null,null,null,""]
[{"$f":"IF(MATRICULA!B26=0,\"\",MATRICULA!B26)","v":""},null,null,"",null,null,"",null,null,null,"",null,null,null,null,""]
["Total",{"$f":"IF(SUM(B14:B23)=0,\"\",SUM(B14:B23))","v":123},67,190,46,39,85,16,70,38,108,163,378,95,706,1192]
[]
["Modalidad","PERSONAL  POR HORAS ",null,null,"DOCENTES",null,null,"R","INASISTENCIAS (Horas)",null,null,"LICENCIAS ECONÓMICAS",null,"LICENCIAS MÉDICAS",null,"TOTAL DE HORAS NO LABORADOS"]
[null,null,null,null,"H","M","T",null,"I ","P.D.","H.N.L.I y P.D.","L.E."," H.N.L.E.","L.M.","H.N.L.M.","HNLI y PD, HNLE, HNLM"]
[{"$f":"IF(MATRICULA!B17=0,\"\",MATRICULA!B17)","v":"Generales Públicas"},null,null,null,484,570,{"$f":"IF(SUM(E28,F28)=0,\"\",SUM(E28,F28))","v":1054},2603,2600,836,{"$f":"IF(SUM(I28,J28)=0,\"\",SUM(I28,J28))","v":3436},935,7479,433,8674,{"$f":"IF(SUM(K28,M28,O28)=0,\"\",SUM(K28,M28,O28))","v":19589}]
[{"$f":"IF(MATRICULA!B18=0,\"\",MATRICULA!B18)","v":"Particulares"},null,null,null,null,null,null,null,null,null,{"$f":"IF(SUM(I29,J29)=0,\"\",SUM(I29,J29))","v":""},null,null,null,null,""]
[{"$f":"IF(MATRICULA!B19=0,\"\",MATRICULA!B19)","v":"Secundaria Técnica"},null,null,null,431,456,887,123,2987,700,3687,757,8984,363,7816,20487]
[{"$f":"IF(MATRICULA!B20=0,\"\",MATRICULA!B20)","v":"Telesecundaria"},null,null,null,134,136,270,null,14,5,19,235,1558,68,974,2551]
[{"$f":"IF(MATRICULA!B21=0,\"\",MATRICULA!B21)","v":""},null,null,null,null,null,"",null,null,null,"",null,null,null,null,""]
[{"$f":"IF(MATRICULA!B22=0,\"\",MATRICULA!B22)","v":""},null,null,null,null,null,"",null,null,null,"",null,null,null,null,""]
[{"$f":"IF(MATRICULA!B23=0,\"\",MATRICULA!B23)","v":""},null,null,null,null,null,"",null,null,null,"",null,null,null,null,""]
[{"$f":"IF(MATRICULA!B24=0,\"\",MATRICULA!B24)","v":""},null,null,null,null,null,"",null,null,null,"",null,null,null,null,""]
[{"$f":"IF(MATRICULA!B25=0,\"\",MATRICULA!B25)","v":""},null,null,null,null,null,"",null,null,null,"",null,null,null,null,""]
[{"$f":"IF(MATRICULA!B26=0,\"\",MATRICULA!B26)","v":""},null,null,null,null,null,"",null,null,null,"",null,null,null,null,""]
["Total",null,null,null,{"$f":"IF(SUM(E28:E37)=0,\"\",SUM(E28:E37))","v":1049},1162,2211,2726,5601,1541,7142,1927,18021,864,17464,42627]
[]
["Zona escolar","ASISTENCIA EDUCATIVA\n(Psicólogos, trabajo social, médicos, prefectos)",null,null,"ADMINISTRATIVO Y DE APOYO",null,null,"R","INASISTENCIAS",null,null,"LICENCIAS ECONÓMICAS",null,"LICENCIAS MÉDICAS",null,"TOTAL DE DÍAS NO LABORADOS"]
[null,"H","M","T","H","M","T",null,"I ","P.D.","D.N.L.I y P.D.","L.E."," D.N.L.E.","L.M.","D.N.L.M.","DNLI y PD, DNLE, DNLM"]
[{"$f":"IF(MATRICULA!B17=0,\"\",MATRICULA!B17)","v":"Generales Públicas"},68,136,{"$f":"IF(SUM(B42,C42)=0,\"\",SUM(B42,C42))","v":204},205,227,{"$f":"IF(SUM(E42,F42)=0,\"\",SUM(E42,F42))","v":432},211,506,262,{"$f":"IF(SUM(I42,J42)=0,\"\",SUM(I42,J42))","v":768},675,1729,254,1785,{"$f":"IF(SUM(K42,M42,O42)=0,\"\",SUM(K42,M42,O42))","v":4282}]
[{"$f":"IF(MATRICULA!B18=0,\"\",MATRICULA!B18)","v":"Particulares"},null,null,"",null,null,"",null,null,null,"",null,null,null,null,""]
[{"$f":"IF(MATRICULA!B19=0,\"\",MATRICULA!B19)","v":"Secundaria Técnica"},81,89,170,146,185,331,55,289,172,461,501,1340,257,1478,3279]
[{"$f":"IF(MATRICULA!B20=0,\"\",MATRICULA!B20)","v":"Telesecundaria"},20,11,31,51,48,99,null,1,67,68,112,332,40,329,729]
[{"$f":"IF(MATRICULA!B21=0,\"\",MATRICULA!B21)","v":""},null,null,"",null,null,"",null,null,null,"",null,null,null,null,""]
[{"$f":"IF(MATRICULA!B22=0,\"\",MATRICULA!B22)","v":""},null,null,"",null,null,"",null,null,null,"",null,null,null,null,""]
[{"$f":"IF(MATRICULA!B23=0,\"\",MATRICULA!B23)","v":""},null,null,"",null,null,"",null,null,null,"",null,null,null,null,""]
[{"$f":"IF(MATRICULA!B24=0,\"\",MATRICULA!B24)","v":""},null,null,"",null,null,"",null,null,null,"",null,null,null,null,""]
[{"$f":"IF(MATRICULA!B25=0,\"\",MATRICULA!B25)","v":""},null,null,"",null,null,"",null,null,null,"",null,null,null,null,""]
[{"$f":"IF(MATRICULA!B26=0,\"\",MATRICULA!B26)","v":""},null,null,"",null,null,"",null,null,null,"",null,null,null,null,""]
["Total",{"$f":"IF(SUM(B42:B51)=0,\"\",SUM(B42:B51))","v":169},236,405,402,460,862,266,796,501,1297,1288,3401,551,3592,8290]
[]
["NOTA:",null,null,null,null,null,null,null,null,"NOTA:"]
["I.: INASISTENCIAS",null,null,null,null,null,null,null,null,"H.N.L.E.: HORAS NO LABORADOS POR LICENCIAS ECONÓMICAS"]
["H.N.L.I.: HORAS NO LABORADAS POR INASISTENCIAS",null,null,null,null,null,null,null,null,"D.N.L.E.:  DÍAS NO LABORADOS POR LICENCIAS ECONÓMICAS"]
["D.N.L.I.: DÍAS NO LABORADOS POR INASISTENCIAS",null,null,null,null,null,null,null,null,"L.M.: PERSONAS QUE PRESENTARON LICENCIAS MÉDICAS"]
["R. :  CANTIDAD DE RETARDOS",null,null,null,null,null,null,null,null,"H.N.L.M.: HORAS NO LABORADAS POR LICENCIAS MÉDICAS"]
["L.E.:   PERSONAL QUE SOLICITÓ LICENCIAS ECONÓMICAS",null,null,null,null,null,null,null,null,"D.N.L.M.: DÍAS NO LABORADOS POR LICENCIAS MÉDICAS"]
["P.D.: PERMISOS DIRECCIÓN"]